BDBM50426643 CHEMBL2326190
SMILES: O=C(Nc1cccnn1)N1CCN(CC1)c1nc(ns1)-c1ccccc1
InChI Key: InChIKey=ZYZILSQXANZBSQ-UHFFFAOYSA-N
Data: 2 IC50
Activity Spreadsheet -- Enzyme Inhibition Constant Data from BindingDB
Found 2 hits for monomerid = 50426643
Trg + Lig
Ki
nM
ΔG°
kcal/mole
IC50
nM
Kd
nM
EC50/IC50
nM
koff
s-1
kon
M-1s-1
pHTemp
°C
Fatty-acid amide hydrolase 1
(Homo sapiens (Human))
BDBM50426643
(CHEMBL2326190)
Show SMILES O=C(Nc1cccnn1)N1CCN(CC1)c1nc(ns1)-c1ccccc1
Show InChI InChI=1S/C17H17N7OS/c25-16(19-14-7-4-8-18-21-14)23-9-11-24(12-10-23)17-20-15(22-26-17)13-5-2-1-3-6-13/h1-8H,9-12H2,(H,19,21,25)
n/an/a 2.90n/an/an/an/an/an/a
Takeda Pharmaceutical Company Ltd
Curated by ChEMBL
Assay Description
Apparent inhibition of human FAAH expressed in CHO-K1 cells using ethanolamine 1-3[H] as substrate after 30 mins by liquid scintillation counting
Bioorg Med Chem 21: 28-41 (2012)
Article DOI: 10.1016/j.bmc.2012.11.006
BindingDB Entry DOI: 10.7270/Q2FN17H6
Fatty-acid amide hydrolase 1 (aa 30-579)
(Rattus norvegicus (rat))
BDBM50426643
(CHEMBL2326190)
Show SMILES O=C(Nc1cccnn1)N1CCN(CC1)c1nc(ns1)-c1ccccc1
Show InChI InChI=1S/C17H17N7OS/c25-16(19-14-7-4-8-18-21-14)23-9-11-24(12-10-23)17-20-15(22-26-17)13-5-2-1-3-6-13/h1-8H,9-12H2,(H,19,21,25)
n/an/a 3.30n/an/an/an/an/an/a
Takeda Pharmaceutical Company Ltd
Curated by ChEMBL
Assay Description
Apparent inhibition of rat FAAH after 30 mins
Bioorg Med Chem 21: 28-41 (2012)
Article DOI: 10.1016/j.bmc.2012.11.006
BindingDB Entry DOI: 10.7270/Q2FN17H6