null
SMILES: COc1cccc(CN2CCc3cc4nc(N)sc4cc3CC2)c1
InChI Key: InChIKey=BZZOYRXQTHGWNC-UHFFFAOYSA-N
Activity Spreadsheet -- Enzyme Inhibition Constant Data from BindingDB
Found 3 hits for monomerid = 50426661
Trg + Lig
Ki
nM
ΔG°
kcal/mole
IC50
nM
Kd
nM
EC50/IC50
nM
koff
s-1
kon
M-1s-1
pHTemp
°C
D(2) dopamine receptor
(Homo sapiens (Human))
BDBM50426661
(CHEMBL2326480)
Show SMILES COc1cccc(CN2CCc3cc4nc(N)sc4cc3CC2)c1
Show InChI InChI=1S/C19H21N3OS/c1-23-16-4-2-3-13(9-16)12-22-7-5-14-10-17-18(24-19(20)21-17)11-15(14)6-8-22/h2-4,9-11H,5-8,12H2,1H3,(H2,20,21)
Reactome pathway
34n/an/an/an/an/an/an/an/a
AstraZeneca
Curated by ChEMBL
Assay Description
Displacement of [3H]raclopride from human D2 dopamine receptor expressed in CHO cell membranes
Bioorg Med Chem Lett 23: 543-7 (2012)
Article DOI: 10.1016/j.bmcl.2012.11.023
BindingDB Entry DOI: 10.7270/Q2639R2X
D(2) dopamine receptor
(Homo sapiens (Human))
BDBM50426661
(CHEMBL2326480)
Show SMILES COc1cccc(CN2CCc3cc4nc(N)sc4cc3CC2)c1
Show InChI InChI=1S/C19H21N3OS/c1-23-16-4-2-3-13(9-16)12-22-7-5-14-10-17-18(24-19(20)21-17)11-15(14)6-8-22/h2-4,9-11H,5-8,12H2,1H3,(H2,20,21)
Reactome pathway
n/an/a 900n/an/an/an/an/an/a
AstraZeneca
Curated by ChEMBL
Assay Description
Antagonist activity at human D2 dopamine receptor expressed in CHO cell membrane by GTPgammaS-binding assay
Bioorg Med Chem Lett 23: 543-7 (2012)
Article DOI: 10.1016/j.bmcl.2012.11.023
BindingDB Entry DOI: 10.7270/Q2639R2X
Potassium voltage-gated channel subfamily H member 2
(Homo sapiens (Human))
BDBM50426661
(CHEMBL2326480)
Show SMILES COc1cccc(CN2CCc3cc4nc(N)sc4cc3CC2)c1
Show InChI InChI=1S/C19H21N3OS/c1-23-16-4-2-3-13(9-16)12-22-7-5-14-10-17-18(24-19(20)21-17)11-15(14)6-8-22/h2-4,9-11H,5-8,12H2,1H3,(H2,20,21)
Reactome pathway
n/an/a 6.60E+3n/an/an/an/an/an/a
AstraZeneca
Curated by ChEMBL
Assay Description
Inhibition of human ERG
Bioorg Med Chem Lett 23: 543-7 (2012)
Article DOI: 10.1016/j.bmcl.2012.11.023
BindingDB Entry DOI: 10.7270/Q2639R2X