BDBM50426714 CHEMBL2326843
SMILES: Nc1nc(N=NCc2ccc(Cl)c(Cl)c2)nc2n(cnc12)[C@@H]1O[C@H](CO)[C@@H](O)[C@H]1O
InChI Key: InChIKey=VKOREHXJTWBOOH-XNIJJKJLSA-N
Data: 3 KI  1 EC50
Activity Spreadsheet -- Enzyme Inhibition Constant Data from BindingDB
Found 4 hits for monomerid = 50426714
Trg + Lig
Ki
nM
ΔG°
kcal/mole
IC50
nM
Kd
nM
EC50/IC50
nM
koff
s-1
kon
M-1s-1
pHTemp
°C
Adenosine Receptors A2a (A2a)
(Rattus norvegicus (rat))
BDBM50426714
(CHEMBL2326843)
Show SMILES Nc1nc(N=NCc2ccc(Cl)c(Cl)c2)nc2n(cnc12)[C@@H]1O[C@H](CO)[C@@H](O)[C@H]1O |r,w:4.3|
Show InChI InChI=1S/C17H17Cl2N7O4/c18-8-2-1-7(3-9(8)19)4-22-25-17-23-14(20)11-15(24-17)26(6-21-11)16-13(29)12(28)10(5-27)30-16/h1-3,6,10,12-13,16,27-29H,4-5H2,(H2,20,23,24)/t10-,12-,13-,16-/m1/s1
Reactome pathway
24n/an/an/an/an/an/an/an/a
University of Bonn
Curated by ChEMBL
Assay Description
Displacement of [3H]CGS21680 from adenosine A2A receptor in rat brain striatal membrane after 60 mins by liquid scintillation counting analysis
Bioorg Med Chem 21: 436-47 (2012)
Article DOI: 10.1016/j.bmc.2012.11.021
BindingDB Entry DOI: 10.7270/Q2ST7R51
Adenosine receptor A3
(Homo sapiens (Human))
BDBM50426714
(CHEMBL2326843)
Show SMILES Nc1nc(N=NCc2ccc(Cl)c(Cl)c2)nc2n(cnc12)[C@@H]1O[C@H](CO)[C@@H](O)[C@H]1O |r,w:4.3|
Show InChI InChI=1S/C17H17Cl2N7O4/c18-8-2-1-7(3-9(8)19)4-22-25-17-23-14(20)11-15(24-17)26(6-21-11)16-13(29)12(28)10(5-27)30-16/h1-3,6,10,12-13,16,27-29H,4-5H2,(H2,20,23,24)/t10-,12-,13-,16-/m1/s1
Reactome pathway
89n/an/an/an/an/an/an/an/a
University of Bonn
Curated by ChEMBL
Assay Description
Displacement of [3H]NECA from human recombinant adenosine A3 receptor expressed in CHO cells after 180 mins by liquid scintillation counting analysis
Bioorg Med Chem 21: 436-47 (2012)
Article DOI: 10.1016/j.bmc.2012.11.021
BindingDB Entry DOI: 10.7270/Q2ST7R51
Adenosine receptor A1
(Rattus norvegicus (rat))
BDBM50426714
(CHEMBL2326843)
Show SMILES Nc1nc(N=NCc2ccc(Cl)c(Cl)c2)nc2n(cnc12)[C@@H]1O[C@H](CO)[C@@H](O)[C@H]1O |r,w:4.3|
Show InChI InChI=1S/C17H17Cl2N7O4/c18-8-2-1-7(3-9(8)19)4-22-25-17-23-14(20)11-15(24-17)26(6-21-11)16-13(29)12(28)10(5-27)30-16/h1-3,6,10,12-13,16,27-29H,4-5H2,(H2,20,23,24)/t10-,12-,13-,16-/m1/s1
Reactome pathway
263n/an/an/an/an/an/an/an/a
University of Bonn
Curated by ChEMBL
Assay Description
Displacement of [3H]CCPA from adenosine A1 receptor in rat brain cortical membrane after 90 mins by liquid scintillation counting analysis
Bioorg Med Chem 21: 436-47 (2012)
Article DOI: 10.1016/j.bmc.2012.11.021
BindingDB Entry DOI: 10.7270/Q2ST7R51
Adenosine receptor A2a
(Homo sapiens (Human))
BDBM50426714
(CHEMBL2326843)
Show SMILES Nc1nc(N=NCc2ccc(Cl)c(Cl)c2)nc2n(cnc12)[C@@H]1O[C@H](CO)[C@@H](O)[C@H]1O |r,w:4.3|
Show InChI InChI=1S/C17H17Cl2N7O4/c18-8-2-1-7(3-9(8)19)4-22-25-17-23-14(20)11-15(24-17)26(6-21-11)16-13(29)12(28)10(5-27)30-16/h1-3,6,10,12-13,16,27-29H,4-5H2,(H2,20,23,24)/t10-,12-,13-,16-/m1/s1
NCI pathway
Reactome pathway
n/an/an/an/a 1.66E+3n/an/an/an/a
University of Bonn
Curated by ChEMBL
Assay Description
Agonist activity at human recombinant adenosine A2A receptor expressed in CHO cells assessed as [3H]cAMP accumulation after 15 mins by liquid scintil...
Bioorg Med Chem 21: 436-47 (2012)
Article DOI: 10.1016/j.bmc.2012.11.021
BindingDB Entry DOI: 10.7270/Q2ST7R51