null
SMILES: COc1cc(ccc1Cl)N1CCN(CC1)C(=O)Cn1nc(c(Cl)c1C)S(C)(=O)=O
InChI Key: InChIKey=VPLNAQRCBLIMNX-UHFFFAOYSA-N
Activity Spreadsheet -- Enzyme Inhibition Constant Data from BindingDB
Found 1 hit for monomerid = 50427076
Trg + Lig
Ki
nM
ΔG°
kcal/mole
IC50
nM
Kd
nM
EC50/IC50
nM
koff
s-1
kon
M-1s-1
pHTemp
°C
C-C chemokine receptor type 1
(Homo sapiens (Human))
BDBM50427076
(CHEMBL2321887)
Show SMILES COc1cc(ccc1Cl)N1CCN(CC1)C(=O)Cn1nc(c(Cl)c1C)S(C)(=O)=O
Show InChI InChI=1S/C18H22Cl2N4O4S/c1-12-17(20)18(29(3,26)27)21-24(12)11-16(25)23-8-6-22(7-9-23)13-4-5-14(19)15(10-13)28-2/h4-5,10H,6-9,11H2,1-3H3
Reactome pathway
n/an/a 10n/an/an/an/an/an/a
ChemoCentryx, Inc.
Curated by ChEMBL
Assay Description
Displacement of [125I]-CCL3/MIP-1alpha from CCR1 in human THP1 cells
Bioorg Med Chem Lett 23: 1228-31 (2013)
Article DOI: 10.1016/j.bmcl.2013.01.005
BindingDB Entry DOI: 10.7270/Q2NZ88Z2