BDBM50427104 CHEMBL2322880
SMILES: COc1cc(cc(Cl)c1Cl)N1CCN(CC1)C(=O)Cn1nc(c(Cl)c1C)C(F)(F)F
InChI Key: InChIKey=XLMSJJASCLFBNY-UHFFFAOYSA-N
Data: 1 IC50
Activity Spreadsheet -- Enzyme Inhibition Constant Data from BindingDB
Found 1 hit for monomerid = 50427104
Trg + Lig
Ki
nM
ΔG°
kcal/mole
IC50
nM
Kd
nM
EC50/IC50
nM
koff
s-1
kon
M-1s-1
pHTemp
°C
C-C chemokine receptor type 1
(Homo sapiens (Human))
BDBM50427104
(CHEMBL2322880)
Show SMILES COc1cc(cc(Cl)c1Cl)N1CCN(CC1)C(=O)Cn1nc(c(Cl)c1C)C(F)(F)F
Show InChI InChI=1S/C18H18Cl3F3N4O2/c1-10-15(20)17(18(22,23)24)25-28(10)9-14(29)27-5-3-26(4-6-27)11-7-12(19)16(21)13(8-11)30-2/h7-8H,3-6,9H2,1-2H3
Reactome pathway
n/an/a 10n/an/an/an/an/an/a
ChemoCentryx, Inc.
Curated by ChEMBL
Assay Description
Displacement of [125I]-CCL3/MIP-1alpha from CCR1 in human THP1 cells
Bioorg Med Chem Lett 23: 1228-31 (2013)
Article DOI: 10.1016/j.bmcl.2013.01.005
BindingDB Entry DOI: 10.7270/Q2NZ88Z2