BDBM50427244 CHEMBL2324870
SMILES: NC(=S)N1N=C(CC1c1ccc2ccccc2c1)c1ccc(Cl)cc1
InChI Key: InChIKey=RGUNUECSTMHJBW-UHFFFAOYSA-N
Data: 2 IC50
Activity Spreadsheet -- Enzyme Inhibition Constant Data from BindingDB
Found 2 hits for monomerid = 50427244
Trg + Lig
Ki
nM
ΔG°
kcal/mole
IC50
nM
Kd
nM
EC50/IC50
nM
koff
s-1
kon
M-1s-1
pHTemp
°C
Epidermal growth factor receptor
(Homo sapiens (Human))
BDBM50427244
(CHEMBL2324870)
Show SMILES NC(=S)N1N=C(CC1c1ccc2ccccc2c1)c1ccc(Cl)cc1 |c:4|
Show InChI InChI=1S/C20H16ClN3S/c21-17-9-7-14(8-10-17)18-12-19(24(23-18)20(22)25)16-6-5-13-3-1-2-4-15(13)11-16/h1-11,19H,12H2,(H2,22,25)
n/an/a 530n/an/an/an/an/an/a
Nanjing University
Curated by ChEMBL
Assay Description
Inhibition of recombinant EGFR cytoplasmic domain (645 to 1186) (unknown origin) autophosphorylation after 1 hr
Bioorg Med Chem 21: 1050-63 (2013)
Article DOI: 10.1016/j.bmc.2013.01.013
BindingDB Entry DOI: 10.7270/Q27S7Q3D
Receptor tyrosine-protein kinase erbB-2
(Homo sapiens (Human))
BDBM50427244
(CHEMBL2324870)
Show SMILES NC(=S)N1N=C(CC1c1ccc2ccccc2c1)c1ccc(Cl)cc1 |c:4|
Show InChI InChI=1S/C20H16ClN3S/c21-17-9-7-14(8-10-17)18-12-19(24(23-18)20(22)25)16-6-5-13-3-1-2-4-15(13)11-16/h1-11,19H,12H2,(H2,22,25)
n/an/a 3.87E+3n/an/an/an/an/an/a
Nanjing University
Curated by ChEMBL
Assay Description
Inhibition of human recombinant HER-2 cytoplasmic domain (676 to 1245) autophosphorylation after 1 hr
Bioorg Med Chem 21: 1050-63 (2013)
Article DOI: 10.1016/j.bmc.2013.01.013
BindingDB Entry DOI: 10.7270/Q27S7Q3D