BDBM50427249 CHEMBL2325105
SMILES: NC(=S)N1N=C(CC1c1cccc2ccccc12)c1ccc(Br)cc1
InChI Key: InChIKey=RDNWDRUSXRDQOG-UHFFFAOYSA-N
Data: 2 IC50
Activity Spreadsheet -- Enzyme Inhibition Constant Data from BindingDB
Found 2 hits for monomerid = 50427249
Trg + Lig
Ki
nM
ΔG°
kcal/mole
IC50
nM
Kd
nM
EC50/IC50
nM
koff
s-1
kon
M-1s-1
pHTemp
°C
Epidermal growth factor receptor
(Homo sapiens (Human))
BDBM50427249
(CHEMBL2325105)
Show SMILES NC(=S)N1N=C(CC1c1cccc2ccccc12)c1ccc(Br)cc1 |c:4|
Show InChI InChI=1S/C20H16BrN3S/c21-15-10-8-14(9-11-15)18-12-19(24(23-18)20(22)25)17-7-3-5-13-4-1-2-6-16(13)17/h1-11,19H,12H2,(H2,22,25)
n/an/a 5.68E+3n/an/an/an/an/an/a
Nanjing University
Curated by ChEMBL
Assay Description
Inhibition of recombinant EGFR cytoplasmic domain (645 to 1186) (unknown origin) autophosphorylation after 1 hr
Bioorg Med Chem 21: 1050-63 (2013)
Article DOI: 10.1016/j.bmc.2013.01.013
BindingDB Entry DOI: 10.7270/Q27S7Q3D
Receptor tyrosine-protein kinase erbB-2
(Homo sapiens (Human))
BDBM50427249
(CHEMBL2325105)
Show SMILES NC(=S)N1N=C(CC1c1cccc2ccccc12)c1ccc(Br)cc1 |c:4|
Show InChI InChI=1S/C20H16BrN3S/c21-15-10-8-14(9-11-15)18-12-19(24(23-18)20(22)25)17-7-3-5-13-4-1-2-6-16(13)17/h1-11,19H,12H2,(H2,22,25)
n/an/a 9.15E+3n/an/an/an/an/an/a
Nanjing University
Curated by ChEMBL
Assay Description
Inhibition of human recombinant HER-2 cytoplasmic domain (676 to 1245) autophosphorylation after 1 hr
Bioorg Med Chem 21: 1050-63 (2013)
Article DOI: 10.1016/j.bmc.2013.01.013
BindingDB Entry DOI: 10.7270/Q27S7Q3D