BDBM50427255 CHEMBL2325114
SMILES: [O-][N+](=O)c1cn2c3NC(=O)NC(c4ccccc4C(F)(F)F)c3c(=O)nc2s1
InChI Key: InChIKey=IKQIOHWTCAENHB-UHFFFAOYSA-N
Data: 1 IC50
Activity Spreadsheet -- Enzyme Inhibition Constant Data from BindingDB
Found 1 hit for monomerid = 50427255
Trg + Lig
Ki
nM
ΔG°
kcal/mole
IC50
nM
Kd
nM
EC50/IC50
nM
koff
s-1
kon
M-1s-1
pHTemp
°C
O-acetylserine sulfhydrylase
(Mycobacterium tuberculosis)
BDBM50427255
(CHEMBL2325114)
Show SMILES [O-][N+](=O)c1cn2c3NC(=O)NC(c4ccccc4C(F)(F)F)c3c(=O)nc2s1
Show InChI InChI=1S/C15H8F3N5O4S/c16-15(17,18)7-4-2-1-3-6(7)10-9-11(20-13(25)19-10)22-5-8(23(26)27)28-14(22)21-12(9)24/h1-5,10H,(H2,19,20,25)
Reactome pathway
n/an/a 1.77E+4n/an/an/an/an/an/a
Birla Institute of Technology& Science-Pilani
Curated by ChEMBL
Assay Description
Inhibition of Mycobacterium tuberculosis CysK1 using O-acetyl-L-serine as substrate assessed as L-cycteine formation after 5 mins by spectrophotometr...
Bioorg Med Chem Lett 23: 1182-6 (2013)
Article DOI: 10.1016/j.bmcl.2013.01.031
BindingDB Entry DOI: 10.7270/Q2416ZDF