BDBM50427508 CHEMBL2322545
SMILES: Cc1c(CC(=O)Nc2ccccc2C(O)=O)c(=O)oc2cc3occ(c3cc12)C(C)(C)C
InChI Key: InChIKey=QEPWEDKBJVGNFY-UHFFFAOYSA-N
Data: 1 EC50
Activity Spreadsheet -- Enzyme Inhibition Constant Data from BindingDB
Found 1 hit for monomerid = 50427508
Trg + Lig
Ki
nM
ΔG°
kcal/mole
IC50
nM
Kd
nM
EC50/IC50
nM
koff
s-1
kon
M-1s-1
pHTemp
°C
Nuclear factor NF-kappa-B (NF-kB)
(Homo sapiens (Human))
BDBM50427508
(CHEMBL2322545)
Show SMILES Cc1c(CC(=O)Nc2ccccc2C(O)=O)c(=O)oc2cc3occ(c3cc12)C(C)(C)C
Show InChI InChI=1S/C25H23NO6/c1-13-15-9-17-18(25(2,3)4)12-31-20(17)11-21(15)32-24(30)16(13)10-22(27)26-19-8-6-5-7-14(19)23(28)29/h5-9,11-12H,10H2,1-4H3,(H,26,27)(H,28,29)
n/an/an/an/a 8.00E+4n/an/an/an/a
Universit£ degli Studi di Padova
Curated by ChEMBL
Assay Description
Inhibition of human NF-kappaB p50/DNA interaction using 32P-labeled oligonucleotides as substrate preincubated for 20 mins before substrate addition ...
J Med Chem 56: 1830-42 (2013)
Article DOI: 10.1021/jm3009647
BindingDB Entry DOI: 10.7270/Q2TH8P10