BDBM50427524 CHEMBL2322258
SMILES: Cc1c(CC(=O)Nc2cccc(c2)C(F)(F)F)c(=O)oc2c(C)c3oc4CCCCc4c3cc12
InChI Key: InChIKey=OSYCHPKSHHSDPQ-UHFFFAOYSA-N
Data: 1 EC50
Activity Spreadsheet -- Enzyme Inhibition Constant Data from BindingDB
Found 1 hit for monomerid = 50427524
Trg + Lig
Ki
nM
ΔG°
kcal/mole
IC50
nM
Kd
nM
EC50/IC50
nM
koff
s-1
kon
M-1s-1
pHTemp
°C
Nuclear factor NF-kappa-B (NF-kB)
(Homo sapiens (Human))
BDBM50427524
(CHEMBL2322258)
Show SMILES Cc1c(CC(=O)Nc2cccc(c2)C(F)(F)F)c(=O)oc2c(C)c3oc4CCCCc4c3cc12
Show InChI InChI=1S/C26H22F3NO4/c1-13-18-11-20-17-8-3-4-9-21(17)33-24(20)14(2)23(18)34-25(32)19(13)12-22(31)30-16-7-5-6-15(10-16)26(27,28)29/h5-7,10-11H,3-4,8-9,12H2,1-2H3,(H,30,31)
n/an/an/an/a 3.00E+6n/an/an/an/a
Universit£ degli Studi di Padova
Curated by ChEMBL
Assay Description
Inhibition of human NF-kappaB p50/DNA interaction using 32P-labeled oligonucleotides as substrate preincubated for 20 mins before substrate addition ...
J Med Chem 56: 1830-42 (2013)
Article DOI: 10.1021/jm3009647
BindingDB Entry DOI: 10.7270/Q2TH8P10