BDBM50427528 CHEMBL2322254
SMILES: Cc1oc2c(C)c3oc(=O)c(CC(=O)Nc4cccc(c4)C(O)=O)c(C)c3cc2c1C
InChI Key: InChIKey=WBFGQSVYUOFFQT-UHFFFAOYSA-N
Data: 1 EC50
Activity Spreadsheet -- Enzyme Inhibition Constant Data from BindingDB
Found 1 hit for monomerid = 50427528
Trg + Lig
Ki
nM
ΔG°
kcal/mole
IC50
nM
Kd
nM
EC50/IC50
nM
koff
s-1
kon
M-1s-1
pHTemp
°C
Nuclear factor NF-kappa-B (NF-kB)
(Homo sapiens (Human))
BDBM50427528
(CHEMBL2322254)
Show SMILES Cc1oc2c(C)c3oc(=O)c(CC(=O)Nc4cccc(c4)C(O)=O)c(C)c3cc2c1C
Show InChI InChI=1S/C24H21NO6/c1-11-14(4)30-21-13(3)22-18(9-17(11)21)12(2)19(24(29)31-22)10-20(26)25-16-7-5-6-15(8-16)23(27)28/h5-9H,10H2,1-4H3,(H,25,26)(H,27,28)
n/an/an/an/a 6.00E+5n/an/an/an/a
Universit£ degli Studi di Padova
Curated by ChEMBL
Assay Description
Inhibition of human NF-kappaB p50/DNA interaction using 32P-labeled oligonucleotides as substrate preincubated for 20 mins before substrate addition ...
J Med Chem 56: 1830-42 (2013)
Article DOI: 10.1021/jm3009647
BindingDB Entry DOI: 10.7270/Q2TH8P10