BDBM50427670 CHEMBL2323518
SMILES: COc1ccc2n(C(=O)c3ccc(Cl)cc3)c(CCC(=O)NS(=O)(=O)c3ccc(OC(F)(F)F)cc3)c(C)c2c1
InChI Key: InChIKey=OLBLIMPINUKZTM-UHFFFAOYSA-N
Data: 2 IC50
Activity Spreadsheet -- Enzyme Inhibition Constant Data from BindingDB
Found 2 hits for monomerid = 50427670
Trg + Lig
Ki
nM
ΔG°
kcal/mole
IC50
nM
Kd
nM
EC50/IC50
nM
koff
s-1
kon
M-1s-1
pHTemp
°C
Aldo-keto reductase family 1 member C2
(Homo sapiens (Human))
BDBM50427670
(CHEMBL2323518)
Show SMILES COc1ccc2n(C(=O)c3ccc(Cl)cc3)c(CCC(=O)NS(=O)(=O)c3ccc(OC(F)(F)F)cc3)c(C)c2c1
Show InChI InChI=1S/C27H22ClF3N2O6S/c1-16-22-15-20(38-2)9-12-24(22)33(26(35)17-3-5-18(28)6-4-17)23(16)13-14-25(34)32-40(36,37)21-10-7-19(8-11-21)39-27(29,30)31/h3-12,15H,13-14H2,1-2H3,(H,32,34)
Reactome pathway
n/an/a 4.04E+4n/an/an/an/an/an/a
Vanderbilt University School of Medicine
Curated by ChEMBL
Assay Description
Inhibition of human recombinant AKR1C2-mediated NADP+-dependent oxidation of S-(+)-1,2,3,4-tetrahydro-1-naphthol
J Med Chem 56: 2429-46 (2013)
Article DOI: 10.1021/jm3017656
BindingDB Entry DOI: 10.7270/Q2X92CMG
Aldo-keto reductase family 1 member C3
(Homo sapiens (Human))
BDBM50427670
(CHEMBL2323518)
Show SMILES COc1ccc2n(C(=O)c3ccc(Cl)cc3)c(CCC(=O)NS(=O)(=O)c3ccc(OC(F)(F)F)cc3)c(C)c2c1
Show InChI InChI=1S/C27H22ClF3N2O6S/c1-16-22-15-20(38-2)9-12-24(22)33(26(35)17-3-5-18(28)6-4-17)23(16)13-14-25(34)32-40(36,37)21-10-7-19(8-11-21)39-27(29,30)31/h3-12,15H,13-14H2,1-2H3,(H,32,34)
n/an/a 2.50E+3n/an/an/an/an/an/a
Vanderbilt University School of Medicine
Curated by ChEMBL
Assay Description
Inhibition of human recombinant AKR1C3-mediated NADP+-dependent oxidation of S-(+)-1,2,3,4-tetrahydro-1-naphthol
J Med Chem 56: 2429-46 (2013)
Article DOI: 10.1021/jm3017656
BindingDB Entry DOI: 10.7270/Q2X92CMG