BDBM50427760 CHEMBL2325160
SMILES: O=C(CNc1c(Nc2ccc3nnsc3c2)c(=O)c1=O)c1ccccc1
InChI Key: InChIKey=WCFGDENFMNWOTK-UHFFFAOYSA-N
Data: 1 IC50
Activity Spreadsheet -- Enzyme Inhibition Constant Data from BindingDB
Found 1 hit for monomerid = 50427760
Trg + Lig
Ki
nM
ΔG°
kcal/mole
IC50
nM
Kd
nM
EC50/IC50
nM
koff
s-1
kon
M-1s-1
pHTemp
°C
Protein arginine methyltransferase 3 (PRMT3)
(Homo sapiens (Human))
BDBM50427760
(CHEMBL2325160)
Show SMILES O=C(CNc1c(Nc2ccc3nnsc3c2)c(=O)c1=O)c1ccccc1
Show InChI InChI=1S/C18H12N4O3S/c23-13(10-4-2-1-3-5-10)9-19-15-16(18(25)17(15)24)20-11-6-7-12-14(8-11)26-22-21-12/h1-8,19-20H,9H2
n/an/a>1.00E+5n/an/an/an/an/an/a
University of North Carolina at Chapel Hill
Curated by ChEMBL
Assay Description
Inhibition of PRMT3 (unknown origin) using histone H4 (1 to 24) as substrate after 1 hr by scintillation proximity assay in presence of [3H]-S-adenos...
J Med Chem 56: 2110-24 (2013)
Article DOI: 10.1021/jm3018332
BindingDB Entry DOI: 10.7270/Q2W95BHJ