BDBM50427968 CHEMBL2325211
SMILES: C[n+]1c(cccc1C#CC1CCCCC1)C#CC1CCCCC1
InChI Key: InChIKey=UZAQXCMNQMXFBY-UHFFFAOYSA-N
Data: 1 KI  1 IC50  1 Kd
Activity Spreadsheet -- Enzyme Inhibition Constant Data from BindingDB
Found 3 hits for monomerid = 50427968
Trg + Lig
Ki
nM
ΔG°
kcal/mole
IC50
nM
Kd
nM
EC50/IC50
nM
koff
s-1
kon
M-1s-1
pHTemp
°C
Potassium voltage-gated channel subfamily H member 2
(Homo sapiens (Human))
BDBM50427968
(CHEMBL2325211)
Show SMILES C[n+]1c(cccc1C#CC1CCCCC1)C#CC1CCCCC1
Show InChI InChI=1S/C22H28N/c1-23-21(17-15-19-9-4-2-5-10-19)13-8-14-22(23)18-16-20-11-6-3-7-12-20/h8,13-14,19-20H,2-7,9-12H2,1H3/q+1
Reactome pathway
1.21E+3n/an/an/an/an/an/an/an/a
Leiden University
Curated by ChEMBL
Assay Description
Displacement of [3H]dofetilide from human Kv11.1 expressed in HEK293 cell membranes by competitive radioligand displacement assay
J Med Chem 58: 5916-29 (2015)
Article DOI: 10.1021/acs.jmedchem.5b00518
BindingDB Entry DOI: 10.7270/Q2FX7C6V
Potassium voltage-gated channel subfamily H member 2
(Homo sapiens (Human))
BDBM50427968
(CHEMBL2325211)
Show SMILES C[n+]1c(cccc1C#CC1CCCCC1)C#CC1CCCCC1
Show InChI InChI=1S/C22H28N/c1-23-21(17-15-19-9-4-2-5-10-19)13-8-14-22(23)18-16-20-11-6-3-7-12-20/h8,13-14,19-20H,2-7,9-12H2,1H3/q+1
Reactome pathway
n/an/a 4.34E+3n/an/an/an/an/an/a
Leiden University
Curated by ChEMBL
Assay Description
Displacement of [3H]astemizole from human ERG K+ channel expressed in HEK293 cells by scintillation spectrophotometric analysis
J Med Chem 56: 2828-40 (2013)
Article DOI: 10.1021/jm301564f
BindingDB Entry DOI: 10.7270/Q22V2HG3
Potassium voltage-gated channel subfamily H member 2
(Homo sapiens (Human))
BDBM50427968
(CHEMBL2325211)
Show SMILES C[n+]1c(cccc1C#CC1CCCCC1)C#CC1CCCCC1
Show InChI InChI=1S/C22H28N/c1-23-21(17-15-19-9-4-2-5-10-19)13-8-14-22(23)18-16-20-11-6-3-7-12-20/h8,13-14,19-20H,2-7,9-12H2,1H3/q+1
Reactome pathway
n/an/an/a 1.07E+3n/an/an/an/an/a
Leiden University
Curated by ChEMBL
Assay Description
Binding affinity to human Kv11.1 expressed in HEK293 cell membranes assessed as binding affinity constant by [3H]dofetilide competition association a...
J Med Chem 58: 5916-29 (2015)
Article DOI: 10.1021/acs.jmedchem.5b00518
BindingDB Entry DOI: 10.7270/Q2FX7C6V