BDBM50428140 CHEMBL2336056
SMILES: CCOC(=O)N1CCC(C)(CN2CC[C@@H](C2)N2C(=O)Cc3ccccc23)CC1
InChI Key: InChIKey=XYJGESNOBLCYIX-SFHVURJKSA-N
Data: 1 IC50  1 EC50
Activity Spreadsheet -- Enzyme Inhibition Constant Data from BindingDB
Found 2 hits for monomerid = 50428140
Trg + Lig
Ki
nM
ΔG°
kcal/mole
IC50
nM
Kd
nM
EC50/IC50
nM
koff
s-1
kon
M-1s-1
pHTemp
°C
Muscarinic acetylcholine receptor M4
(Homo sapiens (Human))
BDBM50428140
(CHEMBL2336056)
Show SMILES CCOC(=O)N1CCC(C)(CN2CC[C@@H](C2)N2C(=O)Cc3ccccc23)CC1 |r|
Show InChI InChI=1S/C22H31N3O3/c1-3-28-21(27)24-12-9-22(2,10-13-24)16-23-11-8-18(15-23)25-19-7-5-4-6-17(19)14-20(25)26/h4-7,18H,3,8-16H2,1-2H3/t18-/m0/s1
Reactome pathway
n/an/an/an/a 15n/an/an/an/a
Dainippon Sumitomo Pharma Co. Ltd.
Curated by ChEMBL
Assay Description
Partial agonist activity at human M4 receptor co-expressed with Galpha16 in CHO cells assessed as calcium mobilization after 60 mins by FLIPR assay
ACS Med Chem Lett 4: 244-8 (2013)
Article DOI: 10.1021/ml300372f
BindingDB Entry DOI: 10.7270/Q20Z74N3
Potassium voltage-gated channel subfamily H member 2
(Homo sapiens (Human))
BDBM50428140
(CHEMBL2336056)
Show SMILES CCOC(=O)N1CCC(C)(CN2CC[C@@H](C2)N2C(=O)Cc3ccccc23)CC1 |r|
Show InChI InChI=1S/C22H31N3O3/c1-3-28-21(27)24-12-9-22(2,10-13-24)16-23-11-8-18(15-23)25-19-7-5-4-6-17(19)14-20(25)26/h4-7,18H,3,8-16H2,1-2H3/t18-/m0/s1
Reactome pathway
n/an/a 3.50E+3n/an/an/an/an/an/a
Dainippon Sumitomo Pharma Co. Ltd.
Curated by ChEMBL
Assay Description
Inhibition of human ERG assessed as decrease in tail current amplitude measured after 5 mins by whole cell patch clamp technique
ACS Med Chem Lett 4: 244-8 (2013)
Article DOI: 10.1021/ml300372f
BindingDB Entry DOI: 10.7270/Q20Z74N3