BDBM50428152 CHEMBL2336061
SMILES: C\C(=N/OCc1ccc(C2CCCCC2)c(c1)C(F)(F)F)c1ccc(CNCCC(O)=O)cn1
InChI Key: InChIKey=PAZFHMRKUCGGMT-KBVAKVRCSA-N
Data: 2 EC50
Activity Spreadsheet -- Enzyme Inhibition Constant Data from BindingDB
Found 2 hits for monomerid = 50428152
Trg + Lig
Ki
nM
ΔG°
kcal/mole
IC50
nM
Kd
nM
EC50/IC50
nM
koff
s-1
kon
M-1s-1
pHTemp
°C
Sphingosine 1-phosphate receptor 1
(Homo sapiens (Human))
BDBM50428152
(CHEMBL2336061)
Show SMILES C\C(=N/OCc1ccc(C2CCCCC2)c(c1)C(F)(F)F)c1ccc(CNCCC(O)=O)cn1
Show InChI InChI=1S/C25H30F3N3O3/c1-17(23-10-8-19(15-30-23)14-29-12-11-24(32)33)31-34-16-18-7-9-21(20-5-3-2-4-6-20)22(13-18)25(26,27)28/h7-10,13,15,20,29H,2-6,11-12,14,16H2,1H3,(H,32,33)/b31-17+
Reactome pathway
n/an/an/an/a 1.40n/an/an/an/a
Genomics Institute of the Novartis Research Foundation
Curated by ChEMBL
Assay Description
Agonist activity at human S1P1 receptor transfected in CHO cells incubated for 10 to 15 mins prior to GTPgamma35S addition measured after 120 mins by...
ACS Med Chem Lett 4: 333-7 (2013)
Article DOI: 10.1021/ml300396r
BindingDB Entry DOI: 10.7270/Q2RF5WCH
Sphingosine 1-phosphate receptor 3
(Homo sapiens (Human))
BDBM50428152
(CHEMBL2336061)
Show SMILES C\C(=N/OCc1ccc(C2CCCCC2)c(c1)C(F)(F)F)c1ccc(CNCCC(O)=O)cn1
Show InChI InChI=1S/C25H30F3N3O3/c1-17(23-10-8-19(15-30-23)14-29-12-11-24(32)33)31-34-16-18-7-9-21(20-5-3-2-4-6-20)22(13-18)25(26,27)28/h7-10,13,15,20,29H,2-6,11-12,14,16H2,1H3,(H,32,33)/b31-17+
NCI pathway
Reactome pathway
n/an/an/an/a 2.60E+3n/an/an/an/a
Genomics Institute of the Novartis Research Foundation
Curated by ChEMBL
Assay Description
Agonist activity at human S1P3 receptor transfected in CHO cells incubated for 10 to 15 mins prior to GTPgamma35S addition measured after 120 mins by...
ACS Med Chem Lett 4: 333-7 (2013)
Article DOI: 10.1021/ml300396r
BindingDB Entry DOI: 10.7270/Q2RF5WCH