BDBM50428171 CHEMBL2336088
SMILES: C\C(=N/OCc1ccc(cc1F)-c1ccccc1)c1ccc(CNCCC(O)=O)cc1
InChI Key: InChIKey=IOGFZDMRKKVGJF-MTDXEUNCSA-N
Data: 1 EC50
Activity Spreadsheet -- Enzyme Inhibition Constant Data from BindingDB
Found 1 hit for monomerid = 50428171
Trg + Lig
Ki
nM
ΔG°
kcal/mole
IC50
nM
Kd
nM
EC50/IC50
nM
koff
s-1
kon
M-1s-1
pHTemp
°C
Sphingosine 1-phosphate receptor 1
(Homo sapiens (Human))
BDBM50428171
(CHEMBL2336088)
Show SMILES C\C(=N/OCc1ccc(cc1F)-c1ccccc1)c1ccc(CNCCC(O)=O)cc1
Show InChI InChI=1S/C25H25FN2O3/c1-18(20-9-7-19(8-10-20)16-27-14-13-25(29)30)28-31-17-23-12-11-22(15-24(23)26)21-5-3-2-4-6-21/h2-12,15,27H,13-14,16-17H2,1H3,(H,29,30)/b28-18+
Reactome pathway
n/an/an/an/a 120n/an/an/an/a
Genomics Institute of the Novartis Research Foundation
Curated by ChEMBL
Assay Description
Agonist activity at human S1P1 receptor transfected in CHO cells incubated for 10 to 15 mins prior to GTPgamma35S addition measured after 120 mins by...
ACS Med Chem Lett 4: 333-7 (2013)
Article DOI: 10.1021/ml300396r
BindingDB Entry DOI: 10.7270/Q2RF5WCH