BDBM50428238 CHEMBL2337449
SMILES: CN1CCN(CC1)c1ccc(cc1NC(=O)c1cccc(C)c1Cl)[N+]([O-])=O
InChI Key: InChIKey=CAKDOAZUWFITOS-UHFFFAOYSA-N
Data: 1 Kd
Activity Spreadsheet -- Enzyme Inhibition Constant Data from BindingDB
Found 1 hit for monomerid = 50428238
Trg + Lig
Ki
nM
ΔG°
kcal/mole
IC50
nM
Kd
nM
EC50/IC50
nM
koff
s-1
kon
M-1s-1
pHTemp
°C
WD repeat-containing protein 5 (WDR5)
(Homo sapiens (Human))
BDBM50428238
(CHEMBL2337449)
Show SMILES CN1CCN(CC1)c1ccc(cc1NC(=O)c1cccc(C)c1Cl)[N+]([O-])=O
Show InChI InChI=1S/C19H21ClN4O3/c1-13-4-3-5-15(18(13)20)19(25)21-16-12-14(24(26)27)6-7-17(16)23-10-8-22(2)9-11-23/h3-7,12H,8-11H2,1-2H3,(H,21,25)
n/an/an/a 1.10E+3n/an/an/an/an/a
EntreMed Inc.
Curated by ChEMBL
Assay Description
Displacement of N-terminal isothiocyanate-fluorescein-labeled H3(ARTKQTARKSTGGKA) peptide from human WDR5 expressed in Escherichia coli BL21(DE3) by ...
ACS Med Chem Lett 4: 353-7 (2013)
Article DOI: 10.1021/ml300467n
BindingDB Entry DOI: 10.7270/Q2C53N6F