BDBM50428316 CHEMBL2338380
SMILES: CCCCCCCCCCCCn1cc[n+](CC(P(O)(O)=O)P(O)([O-])=O)c1
InChI Key: InChIKey=LPGGFVFFIYFOME-UHFFFAOYSA-N
Data: 2 IC50
Activity Spreadsheet -- Enzyme Inhibition Constant Data from BindingDB
Found 2 hits for monomerid = 50428316
Trg + Lig
Ki
nM
ΔG°
kcal/mole
IC50
nM
Kd
nM
EC50/IC50
nM
koff
s-1
kon
M-1s-1
pHTemp
°C
Farnesyl diphosphate synthase
(Homo sapiens (Human))
BDBM50428316
(CHEMBL2338380)
Show SMILES CCCCCCCCCCCCn1cc[n+](CC(P(O)(O)=O)P(O)([O-])=O)c1
Show InChI InChI=1S/C17H34N2O6P2/c1-2-3-4-5-6-7-8-9-10-11-12-18-13-14-19(16-18)15-17(26(20,21)22)27(23,24)25/h13-14,16-17H,2-12,15H2,1H3,(H3-,20,21,22,23,24,25)
Reactome pathway
n/an/a 310n/an/an/an/an/an/a
PrenylX Research Institute
Curated by ChEMBL
Assay Description
Binding affinity to human FPPS at 1 mM by X-ray crystallographic analysis
ACS Med Chem Lett 4: 423-427 (2013)
Article DOI: 10.1021/ml4000436
BindingDB Entry DOI: 10.7270/Q2KP83GB
Farnesyl diphosphate synthase
(Homo sapiens (Human))
BDBM50428316
(CHEMBL2338380)
Show SMILES CCCCCCCCCCCCn1cc[n+](CC(P(O)(O)=O)P(O)([O-])=O)c1
Show InChI InChI=1S/C17H34N2O6P2/c1-2-3-4-5-6-7-8-9-10-11-12-18-13-14-19(16-18)15-17(26(20,21)22)27(23,24)25/h13-14,16-17H,2-12,15H2,1H3,(H3-,20,21,22,23,24,25)
Reactome pathway
n/an/a 370n/an/an/an/an/an/a
PrenylX Research Institute
Curated by ChEMBL
Assay Description
Inhibition of His6-tagged human truncated FPPS (6-353) expressed in Escherichia coli BL21(DE3) cells using geranyl diphosphate and isopentenyl diphos...
ACS Med Chem Lett 4: 423-427 (2013)
Article DOI: 10.1021/ml4000436
BindingDB Entry DOI: 10.7270/Q2KP83GB