null
SMILES: COc1ccc(-c2cc3[C@@H]4CNCC[C@@H]4N4CCCc(c2)c34)c(c1)C(F)(F)F
InChI Key: InChIKey=YLYUXVJVGYRALA-ICSRJNTNSA-N
Activity Spreadsheet -- Enzyme Inhibition Constant Data from BindingDB
Found 3 hits for monomerid = 50428542
Trg + Lig
Ki
nM
ΔG°
kcal/mole
IC50
nM
Kd
nM
EC50/IC50
nM
koff
s-1
kon
M-1s-1
pHTemp
°C
5-hydroxytryptamine receptor 2B
(Homo sapiens (Human))
BDBM50428542
(CHEMBL2337102)
Show SMILES COc1ccc(-c2cc3[C@@H]4CNCC[C@@H]4N4CCCc(c2)c34)c(c1)C(F)(F)F |r|
Show InChI InChI=1S/C22H23F3N2O/c1-28-15-4-5-16(19(11-15)22(23,24)25)14-9-13-3-2-8-27-20-6-7-26-12-18(20)17(10-14)21(13)27/h4-5,9-11,18,20,26H,2-3,6-8,12H2,1H3/t18-,20-/m0/s1
Reactome pathway
14n/an/an/an/an/an/an/an/a
Bristol-Myers Squibb Research and Development
Curated by ChEMBL
Assay Description
Agonist activity at 5-HT2B receptor (unknown origin)
Bioorg Med Chem Lett 23: 330-5 (2012)
Article DOI: 10.1016/j.bmcl.2012.10.091
BindingDB Entry DOI: 10.7270/Q2V12656
5-hydroxytryptamine receptor 2A
(Homo sapiens (Human))
BDBM50428542
(CHEMBL2337102)
Show SMILES COc1ccc(-c2cc3[C@@H]4CNCC[C@@H]4N4CCCc(c2)c34)c(c1)C(F)(F)F |r|
Show InChI InChI=1S/C22H23F3N2O/c1-28-15-4-5-16(19(11-15)22(23,24)25)14-9-13-3-2-8-27-20-6-7-26-12-18(20)17(10-14)21(13)27/h4-5,9-11,18,20,26H,2-3,6-8,12H2,1H3/t18-,20-/m0/s1
Reactome pathway
1.28E+3n/an/an/an/an/an/an/an/a
Bristol-Myers Squibb Research and Development
Curated by ChEMBL
Assay Description
Agonist activity at 5-HT2A receptor (unknown origin)
Bioorg Med Chem Lett 23: 330-5 (2012)
Article DOI: 10.1016/j.bmcl.2012.10.091
BindingDB Entry DOI: 10.7270/Q2V12656
5-hydroxytryptamine receptor 2C
(Homo sapiens (Human))
BDBM50428542
(CHEMBL2337102)
Show SMILES COc1ccc(-c2cc3[C@@H]4CNCC[C@@H]4N4CCCc(c2)c34)c(c1)C(F)(F)F |r|
Show InChI InChI=1S/C22H23F3N2O/c1-28-15-4-5-16(19(11-15)22(23,24)25)14-9-13-3-2-8-27-20-6-7-26-12-18(20)17(10-14)21(13)27/h4-5,9-11,18,20,26H,2-3,6-8,12H2,1H3/t18-,20-/m0/s1
Reactome pathway
n/an/an/an/a 168n/an/an/an/a
Bristol-Myers Squibb Research and Development
Curated by ChEMBL
Assay Description
Agonist activity at 5-HT2C receptor (unknown origin)
Bioorg Med Chem Lett 23: 330-5 (2012)
Article DOI: 10.1016/j.bmcl.2012.10.091
BindingDB Entry DOI: 10.7270/Q2V12656