null
SMILES: CN1CCC(COCc2cc(cc(n2)C#N)C(F)(F)F)(CC1)c1ccccc1
InChI Key: InChIKey=CQJXBNDZWCFOLX-UHFFFAOYSA-N
Activity Spreadsheet -- Enzyme Inhibition Constant Data from BindingDB
Found 3 hits for monomerid = 50428766
Trg + Lig
Ki
nM
ΔG°
kcal/mole
IC50
nM
Kd
nM
EC50/IC50
nM
koff
s-1
kon
M-1s-1
pHTemp
°C
Potassium voltage-gated channel subfamily H member 2
(Homo sapiens (Human))
BDBM50428766
(CHEMBL2333631)
Show SMILES CN1CCC(COCc2cc(cc(n2)C#N)C(F)(F)F)(CC1)c1ccccc1
Show InChI InChI=1S/C21H22F3N3O/c1-27-9-7-20(8-10-27,16-5-3-2-4-6-16)15-28-14-19-12-17(21(22,23)24)11-18(13-25)26-19/h2-6,11-12H,7-10,14-15H2,1H3
Reactome pathway
n/an/a 3.30E+4n/an/an/an/an/an/a
Bristol-Myers Squibb Research and Development
Curated by ChEMBL
Assay Description
Inhibition of human ERG
Bioorg Med Chem Lett 23: 407-11 (2012)
Article DOI: 10.1016/j.bmcl.2012.11.094
BindingDB Entry DOI: 10.7270/Q2S46TBT
Sodium-dependent serotonin transporter
(Homo sapiens (Human))
BDBM50428766
(CHEMBL2333631)
Show SMILES CN1CCC(COCc2cc(cc(n2)C#N)C(F)(F)F)(CC1)c1ccccc1
Show InChI InChI=1S/C21H22F3N3O/c1-27-9-7-20(8-10-27,16-5-3-2-4-6-16)15-28-14-19-12-17(21(22,23)24)11-18(13-25)26-19/h2-6,11-12H,7-10,14-15H2,1H3
n/an/a 4.30n/an/an/an/an/an/a
Bristol-Myers Squibb Research and Development
Curated by ChEMBL
Assay Description
Displacement of [125I]RTI-55 from human SERT expressed in HEK293 cell membranes after 1 hr by scintillation counting analysis
Bioorg Med Chem Lett 23: 407-11 (2012)
Article DOI: 10.1016/j.bmcl.2012.11.094
BindingDB Entry DOI: 10.7270/Q2S46TBT
Substance-P receptor
(Homo sapiens (Human))
BDBM50428766
(CHEMBL2333631)
Show SMILES CN1CCC(COCc2cc(cc(n2)C#N)C(F)(F)F)(CC1)c1ccccc1
Show InChI InChI=1S/C21H22F3N3O/c1-27-9-7-20(8-10-27,16-5-3-2-4-6-16)15-28-14-19-12-17(21(22,23)24)11-18(13-25)26-19/h2-6,11-12H,7-10,14-15H2,1H3
Reactome pathway
n/an/a 380n/an/an/an/an/an/a
Bristol-Myers Squibb Research and Development
Curated by ChEMBL
Assay Description
Displacement of [125I] Substance P from human NK1 receptor expressed in human U373 cell membranes after 1 hr by scintillation counting analysis
Bioorg Med Chem Lett 23: 407-11 (2012)
Article DOI: 10.1016/j.bmcl.2012.11.094
BindingDB Entry DOI: 10.7270/Q2S46TBT