BDBM50428794 CHEMBL2335231
SMILES: [O-][N+](=O)\C=C\c1ccc(Br)o1
InChI Key: InChIKey=ZPOIRJXWLVUIPT-ONEGZZNKSA-N
Data: 1 IC50
Activity Spreadsheet -- Enzyme Inhibition Constant Data from BindingDB
Found 1 hit for monomerid = 50428794
Trg + Lig
Ki
nM
ΔG°
kcal/mole
IC50
nM
Kd
nM
EC50/IC50
nM
koff
s-1
kon
M-1s-1
pHTemp
°C
MurA (E. coli)
(Escherichia coli K-12 (Enterobacteria))
BDBM50428794
(CHEMBL2335231)
Show SMILES [O-][N+](=O)\C=C\c1ccc(Br)o1
Show InChI InChI=1S/C6H4BrNO3/c7-6-2-1-5(11-6)3-4-8(9)10/h1-4H/b4-3+
n/an/a 2.73E+4n/an/an/an/an/an/a
Heidelberg University
Curated by ChEMBL
Assay Description
Inhibition of Escherichia coli MurA expressed in Escherichia coli BL21(lamdaDE3) using UNAG and PEP as substrate incubated for 10 mins prior to PEP a...
Bioorg Med Chem 21: 795-804 (2013)
Article DOI: 10.1016/j.bmc.2012.11.018
BindingDB Entry DOI: 10.7270/Q2HM59SD