BDBM50428826 CHEMBL2337127
SMILES: [#6]-[#8]-c1cc(-[#6]-[#6]-c2ccccc2)c(-[#6](-[#8])=O)c(-[#8])c1-[#6]\[#6]=[#6](/[#6])-[#6]-[#6]\[#6]=[#6](\[#6])-[#6]
InChI Key: InChIKey=DKNIJLWIVUCTHW-CPNJWEJPSA-N
Data: 3 Kd  2 EC50
PDB links: 1 PDB ID matches this monomer.
Activity Spreadsheet -- Enzyme Inhibition Constant Data from BindingDB
Found 5 hits for monomerid = 50428826
Trg + Lig
Ki
nM
ΔG°
kcal/mole
IC50
nM
Kd
nM
EC50/IC50
nM
koff
s-1
kon
M-1s-1
pHTemp
°C
Peroxisome proliferator-activated receptor
(Homo sapiens (Human))
BDBM50428826
(CHEMBL2337127)
Show SMILES [#6]-[#8]-c1cc(-[#6]-[#6]-c2ccccc2)c(-[#6](-[#8])=O)c(-[#8])c1-[#6]\[#6]=[#6](/[#6])-[#6]-[#6]\[#6]=[#6](\[#6])-[#6]
Show InChI InChI=1S/C26H32O4/c1-18(2)9-8-10-19(3)13-16-22-23(30-4)17-21(24(25(22)27)26(28)29)15-14-20-11-6-5-7-12-20/h5-7,9,11-13,17,27H,8,10,14-16H2,1-4H3,(H,28,29)/b19-13+
NCI pathway
Reactome pathway
n/an/an/an/a 73n/an/an/an/a
Max Planck Institute for Molecular Genetics
Curated by ChEMBL
Assay Description
Agonist at human PPARgamma LBD expressed in human HEK293 cells cotransfected with GAL4-Luc assessed as transcriptional activation by luciferase repor...
J Nat Prod 78: 1160-4 (2015)
Article DOI: 10.1021/np500747y
BindingDB Entry DOI: 10.7270/Q24T6M4N
3D
3D Structure (crystal)
Peroxisome proliferator-activated receptor
(Homo sapiens (Human))
BDBM50428826
(CHEMBL2337127)
Show SMILES [#6]-[#8]-c1cc(-[#6]-[#6]-c2ccccc2)c(-[#6](-[#8])=O)c(-[#8])c1-[#6]\[#6]=[#6](/[#6])-[#6]-[#6]\[#6]=[#6](\[#6])-[#6]
Show InChI InChI=1S/C26H32O4/c1-18(2)9-8-10-19(3)13-16-22-23(30-4)17-21(24(25(22)27)26(28)29)15-14-20-11-6-5-7-12-20/h5-7,9,11-13,17,27H,8,10,14-16H2,1-4H3,(H,28,29)/b19-13+
NCI pathway
Reactome pathway
n/an/an/a 19n/an/an/an/an/a
Helmholtz Centre for Infection Research
Curated by ChEMBL
Assay Description
Binding affinity to human PPARgamma (unknown origin) by competitive TR-FRET assay
J Med Chem 56: 1535-43 (2013)
Article DOI: 10.1021/jm3013272
BindingDB Entry DOI: 10.7270/Q2R49S4J
3D
3D Structure (crystal)
Peroxisome proliferator-activated receptor
(Homo sapiens (Human))
BDBM50428826
(CHEMBL2337127)
Show SMILES [#6]-[#8]-c1cc(-[#6]-[#6]-c2ccccc2)c(-[#6](-[#8])=O)c(-[#8])c1-[#6]\[#6]=[#6](/[#6])-[#6]-[#6]\[#6]=[#6](\[#6])-[#6]
Show InChI InChI=1S/C26H32O4/c1-18(2)9-8-10-19(3)13-16-22-23(30-4)17-21(24(25(22)27)26(28)29)15-14-20-11-6-5-7-12-20/h5-7,9,11-13,17,27H,8,10,14-16H2,1-4H3,(H,28,29)/b19-13+
NCI pathway
Reactome pathway
n/an/an/an/a 50n/an/an/an/a
Helmholtz Centre for Infection Research
Curated by ChEMBL
Assay Description
Agonist at human PPARgamma LBD expressed in human HEK293 cells cotransfected with GAL4-Luc assessed as transcriptional activation by luciferase repor...
J Med Chem 56: 1535-43 (2013)
Article DOI: 10.1021/jm3013272
BindingDB Entry DOI: 10.7270/Q2R49S4J
3D
3D Structure (crystal)
Peroxisome proliferator-activated receptor alpha (PPAR alpha)
(Homo sapiens (Human))
BDBM50428826
(CHEMBL2337127)
Show SMILES [#6]-[#8]-c1cc(-[#6]-[#6]-c2ccccc2)c(-[#6](-[#8])=O)c(-[#8])c1-[#6]\[#6]=[#6](/[#6])-[#6]-[#6]\[#6]=[#6](\[#6])-[#6]
Show InChI InChI=1S/C26H32O4/c1-18(2)9-8-10-19(3)13-16-22-23(30-4)17-21(24(25(22)27)26(28)29)15-14-20-11-6-5-7-12-20/h5-7,9,11-13,17,27H,8,10,14-16H2,1-4H3,(H,28,29)/b19-13+
n/an/an/a 2.60E+3n/an/an/an/an/a
Helmholtz Centre for Infection Research
Curated by ChEMBL
Assay Description
Binding affinity to human PPARalpha (unknown origin) by competitive TR-FRET assay
J Med Chem 56: 1535-43 (2013)
Article DOI: 10.1021/jm3013272
BindingDB Entry DOI: 10.7270/Q2R49S4J
Peroxisome proliferator-activated receptor delta
(Homo sapiens (Human))
BDBM50428826
(CHEMBL2337127)
Show SMILES [#6]-[#8]-c1cc(-[#6]-[#6]-c2ccccc2)c(-[#6](-[#8])=O)c(-[#8])c1-[#6]\[#6]=[#6](/[#6])-[#6]-[#6]\[#6]=[#6](\[#6])-[#6]
Show InChI InChI=1S/C26H32O4/c1-18(2)9-8-10-19(3)13-16-22-23(30-4)17-21(24(25(22)27)26(28)29)15-14-20-11-6-5-7-12-20/h5-7,9,11-13,17,27H,8,10,14-16H2,1-4H3,(H,28,29)/b19-13+
n/an/an/a 1.80E+3n/an/an/an/an/a
Helmholtz Centre for Infection Research
Curated by ChEMBL
Assay Description
Binding affinity to human PPARdelta (unknown origin) by competitive TR-FRET assay
J Med Chem 56: 1535-43 (2013)
Article DOI: 10.1021/jm3013272
BindingDB Entry DOI: 10.7270/Q2R49S4J