BDBM50428874 CHEMBL2331777
SMILES: CCNC(=O)c1cc(NS(=O)(=O)c2ccc(I)cc2)ccc1Oc1cncc(Cl)c1
InChI Key: InChIKey=DLEOYLKIYQEQPJ-UHFFFAOYSA-N
Data: 1 IC50  1 EC50
Activity Spreadsheet -- Enzyme Inhibition Constant Data from BindingDB
Found 2 hits for monomerid = 50428874
Trg + Lig
Ki
nM
ΔG°
kcal/mole
IC50
nM
Kd
nM
EC50/IC50
nM
koff
s-1
kon
M-1s-1
pHTemp
°C
Peroxisome proliferator-activated receptor
(Homo sapiens (Human))
BDBM50428874
(CHEMBL2331777)
Show SMILES CCNC(=O)c1cc(NS(=O)(=O)c2ccc(I)cc2)ccc1Oc1cncc(Cl)c1
Show InChI InChI=1S/C20H17ClIN3O4S/c1-2-24-20(26)18-10-15(25-30(27,28)17-6-3-14(22)4-7-17)5-8-19(18)29-16-9-13(21)11-23-12-16/h3-12,25H,2H2,1H3,(H,24,26)
NCI pathway
Reactome pathway
n/an/a 25n/an/an/an/an/an/a
Amgen, Inc.
Curated by ChEMBL
Assay Description
Displacement of [3H]-rosiglitazone from GST-tagged PPARgammaLBD (unknown origin) after 1 hr by scintillation proximity assay
Bioorg Med Chem 21: 979-92 (2013)
Article DOI: 10.1016/j.bmc.2012.11.058
BindingDB Entry DOI: 10.7270/Q23F4R13
Peroxisome proliferator-activated receptor
(Homo sapiens (Human))
BDBM50428874
(CHEMBL2331777)
Show SMILES CCNC(=O)c1cc(NS(=O)(=O)c2ccc(I)cc2)ccc1Oc1cncc(Cl)c1
Show InChI InChI=1S/C20H17ClIN3O4S/c1-2-24-20(26)18-10-15(25-30(27,28)17-6-3-14(22)4-7-17)5-8-19(18)29-16-9-13(21)11-23-12-16/h3-12,25H,2H2,1H3,(H,24,26)
NCI pathway
Reactome pathway
n/an/an/an/a 200n/an/an/an/a
Amgen, Inc.
Curated by ChEMBL
Assay Description
Transactivation of GAL4 DBD-fused human PPARgamma-LBD expressed in HEK293 cells after 24 hrs by luciferase reporter gene assay
Bioorg Med Chem 21: 979-92 (2013)
Article DOI: 10.1016/j.bmc.2012.11.058
BindingDB Entry DOI: 10.7270/Q23F4R13