BDBM50429069 CHEMBL2335736
SMILES: COc1cc2CCN3CC[C@@](O)(C[C@@H]3c2cc1O)c1ccc(OC(F)(F)F)cc1
InChI Key: InChIKey=WCWNXHJYVSNEHQ-YLJYHZDGSA-N
Data: 2 KI  2 IC50  1 EC50
Activity Spreadsheet -- Enzyme Inhibition Constant Data from BindingDB
Found 5 hits for monomerid = 50429069
Trg + Lig
Ki
nM
ΔG°
kcal/mole
IC50
nM
Kd
nM
EC50/IC50
nM
koff
s-1
kon
M-1s-1
pHTemp
°C
D(1A) dopamine receptor
(Homo sapiens (Human))
BDBM50429069
(CHEMBL2335736)
Show SMILES COc1cc2CCN3CC[C@@](O)(C[C@@H]3c2cc1O)c1ccc(OC(F)(F)F)cc1 |r|
Show InChI InChI=1S/C21H22F3NO4/c1-28-19-10-13-6-8-25-9-7-20(27,12-17(25)16(13)11-18(19)26)14-2-4-15(5-3-14)29-21(22,23)24/h2-5,10-11,17,26-27H,6-9,12H2,1H3/t17-,20-/m1/s1
2n/an/an/an/an/an/an/an/a
Sanofi US
Curated by ChEMBL
Assay Description
Displacement of [3H]SCH23390 from dopamine D1 receptor (unknown origin) expressed in CHO cell membranes after 60 mins
Bioorg Med Chem Lett 23: 1498-501 (2013)
Article DOI: 10.1016/j.bmcl.2012.12.046
BindingDB Entry DOI: 10.7270/Q290255G
D(2) dopamine receptor
(Homo sapiens (Human))
BDBM50429069
(CHEMBL2335736)
Show SMILES COc1cc2CCN3CC[C@@](O)(C[C@@H]3c2cc1O)c1ccc(OC(F)(F)F)cc1 |r|
Show InChI InChI=1S/C21H22F3NO4/c1-28-19-10-13-6-8-25-9-7-20(27,12-17(25)16(13)11-18(19)26)14-2-4-15(5-3-14)29-21(22,23)24/h2-5,10-11,17,26-27H,6-9,12H2,1H3/t17-,20-/m1/s1
Reactome pathway
4n/an/an/an/an/an/an/an/a
Sanofi US
Curated by ChEMBL
Assay Description
Displacement of [3H]N-methylspiperone from dopamine D2 receptor (unknown origin) expressed in CHO cell membranes after 60 mins
Bioorg Med Chem Lett 23: 1498-501 (2013)
Article DOI: 10.1016/j.bmcl.2012.12.046
BindingDB Entry DOI: 10.7270/Q290255G
Cytochrome P450 2D6
(Homo sapiens (Human))
BDBM50429069
(CHEMBL2335736)
Show SMILES COc1cc2CCN3CC[C@@](O)(C[C@@H]3c2cc1O)c1ccc(OC(F)(F)F)cc1 |r|
Show InChI InChI=1S/C21H22F3NO4/c1-28-19-10-13-6-8-25-9-7-20(27,12-17(25)16(13)11-18(19)26)14-2-4-15(5-3-14)29-21(22,23)24/h2-5,10-11,17,26-27H,6-9,12H2,1H3/t17-,20-/m1/s1
n/an/a 840n/an/an/an/an/an/a
Sanofi US
Curated by ChEMBL
Assay Description
Inhibition of CYP2D6 (unknown origin)
Bioorg Med Chem Lett 23: 1498-501 (2013)
Article DOI: 10.1016/j.bmcl.2012.12.046
BindingDB Entry DOI: 10.7270/Q290255G
D(2) dopamine receptor
(Homo sapiens (Human))
BDBM50429069
(CHEMBL2335736)
Show SMILES COc1cc2CCN3CC[C@@](O)(C[C@@H]3c2cc1O)c1ccc(OC(F)(F)F)cc1 |r|
Show InChI InChI=1S/C21H22F3NO4/c1-28-19-10-13-6-8-25-9-7-20(27,12-17(25)16(13)11-18(19)26)14-2-4-15(5-3-14)29-21(22,23)24/h2-5,10-11,17,26-27H,6-9,12H2,1H3/t17-,20-/m1/s1
Reactome pathway
n/an/a 6n/an/an/an/an/an/a
Sanofi US
Curated by ChEMBL
Assay Description
Antagonist activity at dopamine D2 receptor (unknown origin) transfected in CHO cell membranes assessed as inhibition of forskolin-stimulated cAMP le...
Bioorg Med Chem Lett 23: 1498-501 (2013)
Article DOI: 10.1016/j.bmcl.2012.12.046
BindingDB Entry DOI: 10.7270/Q290255G
D(1A) dopamine receptor
(Homo sapiens (Human))
BDBM50429069
(CHEMBL2335736)
Show SMILES COc1cc2CCN3CC[C@@](O)(C[C@@H]3c2cc1O)c1ccc(OC(F)(F)F)cc1 |r|
Show InChI InChI=1S/C21H22F3NO4/c1-28-19-10-13-6-8-25-9-7-20(27,12-17(25)16(13)11-18(19)26)14-2-4-15(5-3-14)29-21(22,23)24/h2-5,10-11,17,26-27H,6-9,12H2,1H3/t17-,20-/m1/s1
n/an/an/an/a 5n/an/an/an/a
Sanofi US
Curated by ChEMBL
Assay Description
Agonist activity at dopamine D1 receptor (unknown origin) transfected in CHO cell membranes assessed as increase in cAMP level after 8 mins by flash ...
Bioorg Med Chem Lett 23: 1498-501 (2013)
Article DOI: 10.1016/j.bmcl.2012.12.046
BindingDB Entry DOI: 10.7270/Q290255G