BDBM50429483 CHEMBL2332868
SMILES: Fc1cccc(NC(=O)Nc2ccc(Oc3ncnc4n[nH]cc34)cc2)c1
InChI Key: InChIKey=NMIMNNFWSUROHT-UHFFFAOYSA-N
Data: 1 IC50
Activity Spreadsheet -- Enzyme Inhibition Constant Data from BindingDB
Found 1 hit for monomerid = 50429483
Trg + Lig
Ki
nM
ΔG°
kcal/mole
IC50
nM
Kd
nM
EC50/IC50
nM
koff
s-1
kon
M-1s-1
pHTemp
°C
Vascular endothelial growth factor receptor 2
(Danio rerio)
BDBM50429483
(CHEMBL2332868)
Show SMILES Fc1cccc(NC(=O)Nc2ccc(Oc3ncnc4n[nH]cc34)cc2)c1
Show InChI InChI=1S/C18H13FN6O2/c19-11-2-1-3-13(8-11)24-18(26)23-12-4-6-14(7-5-12)27-17-15-9-22-25-16(15)20-10-21-17/h1-10H,(H2,23,24,26)(H,20,21,22,25)
Reactome pathway
n/an/a 1.66E+4n/an/an/an/an/an/a
Sichuan University
Curated by ChEMBL
Assay Description
Inhibition of VEGFR2 in transgenic zebrafish embryo assessed as inhibition of intersegmental vessels formation measured 33 hrs post fertilization by ...
J Med Chem 56: 1641-55 (2013)
Article DOI: 10.1021/jm301537p
BindingDB Entry DOI: 10.7270/Q29S1SC5