BDBM50429499 CHEMBL2332852
SMILES: FC(F)(F)c1ccc(NC(=O)Nc2cccc(Oc3ncnc4n[nH]cc34)c2)cc1
InChI Key: InChIKey=DUAXMDPWOSWFOO-UHFFFAOYSA-N
Data: 1 IC50
Activity Spreadsheet -- Enzyme Inhibition Constant Data from BindingDB
Found 1 hit for monomerid = 50429499
Trg + Lig
Ki
nM
ΔG°
kcal/mole
IC50
nM
Kd
nM
EC50/IC50
nM
koff
s-1
kon
M-1s-1
pHTemp
°C
Vascular endothelial growth factor receptor 2
(Danio rerio)
BDBM50429499
(CHEMBL2332852)
Show SMILES FC(F)(F)c1ccc(NC(=O)Nc2cccc(Oc3ncnc4n[nH]cc34)c2)cc1
Show InChI InChI=1S/C19H13F3N6O2/c20-19(21,22)11-4-6-12(7-5-11)26-18(29)27-13-2-1-3-14(8-13)30-17-15-9-25-28-16(15)23-10-24-17/h1-10H,(H2,26,27,29)(H,23,24,25,28)
Reactome pathway
n/an/a>1.00E+5n/an/an/an/an/an/a
Sichuan University
Curated by ChEMBL
Assay Description
Inhibition of VEGFR2 in transgenic zebrafish embryo assessed as inhibition of intersegmental vessels formation measured 33 hrs post fertilization by ...
J Med Chem 56: 1641-55 (2013)
Article DOI: 10.1021/jm301537p
BindingDB Entry DOI: 10.7270/Q29S1SC5