BDBM50429882 CHEMBL2333372
SMILES: FC(F)(F)C(=O)c1ccc(cc1)C(=O)N1CCOc2ccc(cc2C1)-c1cccnc1
InChI Key: InChIKey=ISTLXUHHFDHVJV-UHFFFAOYSA-N
Data: 1 IC50
Activity Spreadsheet -- Enzyme Inhibition Constant Data from BindingDB
Found 1 hit for monomerid = 50429882
Trg + Lig
Ki
nM
ΔG°
kcal/mole
IC50
nM
Kd
nM
EC50/IC50
nM
koff
s-1
kon
M-1s-1
pHTemp
°C
Phosphatidylinositol 4,5-bisphosphate 3-kinase catalytic subunit alpha isoform
(Homo sapiens (Human))
BDBM50429882
(CHEMBL2333372)
Show SMILES FC(F)(F)C(=O)c1ccc(cc1)C(=O)N1CCOc2ccc(cc2C1)-c1cccnc1
Show InChI InChI=1S/C23H17F3N2O3/c24-23(25,26)21(29)15-3-5-16(6-4-15)22(30)28-10-11-31-20-8-7-17(12-19(20)14-28)18-2-1-9-27-13-18/h1-9,12-13H,10-11,14H2
NCI pathway
Reactome pathway
n/an/a 1.13E+3n/an/an/an/an/an/a
Exelixis
Curated by ChEMBL
Assay Description
Inhibition of PI3Kalpha (unknown origin) using PIP2 as substrate after 2 hrs by luminescence assay
J Med Chem 56: 2218-34 (2013)
Article DOI: 10.1021/jm3007933
BindingDB Entry DOI: 10.7270/Q2ZC847X