BDBM50429895 CHEMBL2333375
SMILES: FC(F)(F)C(=O)c1ccc(cc1)C(=O)N1CCOc2ccc(cc2C1)-c1ccc2[nH]ncc2c1
InChI Key: InChIKey=ZQGMPGAUEIXAHZ-UHFFFAOYSA-N
Data: 1 IC50
Activity Spreadsheet -- Enzyme Inhibition Constant Data from BindingDB
Found 1 hit for monomerid = 50429895
Trg + Lig
Ki
nM
ΔG°
kcal/mole
IC50
nM
Kd
nM
EC50/IC50
nM
koff
s-1
kon
M-1s-1
pHTemp
°C
Phosphatidylinositol 4,5-bisphosphate 3-kinase catalytic subunit alpha isoform
(Homo sapiens (Human))
BDBM50429895
(CHEMBL2333375)
Show SMILES FC(F)(F)C(=O)c1ccc(cc1)C(=O)N1CCOc2ccc(cc2C1)-c1ccc2[nH]ncc2c1
Show InChI InChI=1S/C25H18F3N3O3/c26-25(27,28)23(32)15-1-3-16(4-2-15)24(33)31-9-10-34-22-8-6-18(12-20(22)14-31)17-5-7-21-19(11-17)13-29-30-21/h1-8,11-13H,9-10,14H2,(H,29,30)
NCI pathway
Reactome pathway
n/an/a 137n/an/an/an/an/an/a
Exelixis
Curated by ChEMBL
Assay Description
Inhibition of PI3Kalpha (unknown origin) using PIP2 as substrate after 2 hrs by luminescence assay
J Med Chem 56: 2218-34 (2013)
Article DOI: 10.1021/jm3007933
BindingDB Entry DOI: 10.7270/Q2ZC847X