BDBM50430350 CHEMBL2333904
SMILES: CCN[C@H](Cc1ccc(Cl)cc1)c1nc2ccc(cc2c(=O)[nH]1)-c1cn[nH]c1
InChI Key: InChIKey=AEJOTVGHCRQIAC-LJQANCHMSA-N
Data: 1 IC50
Activity Spreadsheet -- Enzyme Inhibition Constant Data from BindingDB
Found 1 hit for monomerid = 50430350
Trg + Lig
Ki
nM
ΔG°
kcal/mole
IC50
nM
Kd
nM
EC50/IC50
nM
koff
s-1
kon
M-1s-1
pHTemp
°C
Rho-associated protein kinase 2
(Homo sapiens (Human))
BDBM50430350
(CHEMBL2333904)
Show SMILES CCN[C@H](Cc1ccc(Cl)cc1)c1nc2ccc(cc2c(=O)[nH]1)-c1cn[nH]c1 |r|
Show InChI InChI=1S/C21H20ClN5O/c1-2-23-19(9-13-3-6-16(22)7-4-13)20-26-18-8-5-14(15-11-24-25-12-15)10-17(18)21(28)27-20/h3-8,10-12,19,23H,2,9H2,1H3,(H,24,25)(H,26,27,28)/t19-/m1/s1
n/an/a 14n/an/an/an/an/an/a
Translational Research Institute
Curated by ChEMBL
Assay Description
Inhibition of human recombinant 6-His-tagged ROCK2 expressed in baculovirus-infected Sf9 cells using LCB-AKRRRLSSLRA-NH2 as substrate after 25 mins b...
Bioorg Med Chem Lett 23: 1592-9 (2013)
Article DOI: 10.1016/j.bmcl.2013.01.109
BindingDB Entry DOI: 10.7270/Q2TD9ZQM