BDBM50430632 CHEMBL2332518
SMILES: CC(C)C[C@H](NC(=O)NCc1ccccc1Cl)C(=O)NO
InChI Key: InChIKey=GMYGHFKIKOTHED-LBPRGKRZSA-N
Data: 2 IC50
PDB links: 1 PDB ID matches this monomer.
Activity Spreadsheet -- Enzyme Inhibition Constant Data from BindingDB
Found 2 hits for monomerid = 50430632
Trg + Lig
Ki
nM
ΔG°
kcal/mole
IC50
nM
Kd
nM
EC50/IC50
nM
koff
s-1
kon
M-1s-1
pHTemp
°C
Aminopeptidase N
(Sus scrofa (Pig))
BDBM50430632
(CHEMBL2332518)
Show SMILES CC(C)C[C@H](NC(=O)NCc1ccccc1Cl)C(=O)NO |r|
Show InChI InChI=1S/C14H20ClN3O3/c1-9(2)7-12(13(19)18-21)17-14(20)16-8-10-5-3-4-6-11(10)15/h3-6,9,12,21H,7-8H2,1-2H3,(H,18,19)(H2,16,17,20)/t12-/m0/s1
n/an/a 220n/an/an/an/an/an/a
Shandong University
Curated by ChEMBL
Assay Description
Inhibition of pig microsomal aminopeptidase N using L-leu-p-nitroanilide as substrate incubated for 5 mins prior to substrate addition measured after...
Bioorg Med Chem 21: 1621-7 (2013)
Article DOI: 10.1016/j.bmc.2013.01.068
BindingDB Entry DOI: 10.7270/Q2W95BJ0
Aminopeptidase N
(Homo sapiens (Human))
BDBM50430632
(CHEMBL2332518)
Show SMILES CC(C)C[C@H](NC(=O)NCc1ccccc1Cl)C(=O)NO |r|
Show InChI InChI=1S/C14H20ClN3O3/c1-9(2)7-12(13(19)18-21)17-14(20)16-8-10-5-3-4-6-11(10)15/h3-6,9,12,21H,7-8H2,1-2H3,(H,18,19)(H2,16,17,20)/t12-/m0/s1
NCI pathway
Reactome pathway
n/an/a 650n/an/an/an/an/an/a
Shandong University
Curated by ChEMBL
Assay Description
Inhibition of aminopeptidase N in human ES2 cells using L-leu-p-nitroanilide as substrate incubated for 5 mins prior to substrate addition measured a...
Bioorg Med Chem 21: 1621-7 (2013)
Article DOI: 10.1016/j.bmc.2013.01.068
BindingDB Entry DOI: 10.7270/Q2W95BJ0