BDBM50430948 CHEMBL2337402
SMILES: Cc1c(CCOCCO[N+]([O-])=O)cc(-c2ccc(cc2)S(C)(=O)=O)n1-c1ccc(F)cc1
InChI Key: InChIKey=FRGVUXUFLCQOPD-UHFFFAOYSA-N
Data: 4 IC50
Activity Spreadsheet -- Enzyme Inhibition Constant Data from BindingDB
Found 4 hits for monomerid = 50430948
Trg + Lig
Ki
nM
ΔG°
kcal/mole
IC50
nM
Kd
nM
EC50/IC50
nM
koff
s-1
kon
M-1s-1
pHTemp
°C
Cyclooxygenase-1 (COX-1)
(Homo sapiens (Human))
BDBM50430948
(CHEMBL2337402)
Show SMILES Cc1c(CCOCCO[N+]([O-])=O)cc(-c2ccc(cc2)S(C)(=O)=O)n1-c1ccc(F)cc1
Show InChI InChI=1S/C22H23FN2O6S/c1-16-18(11-12-30-13-14-31-25(26)27)15-22(24(16)20-7-5-19(23)6-8-20)17-3-9-21(10-4-17)32(2,28)29/h3-10,15H,11-14H2,1-2H3
n/an/a 3.12E+4n/an/an/an/an/an/a
Universit£ degli Studi di Siena
Curated by ChEMBL
Assay Description
Inhibition of COX1 in human whole blood assessed as reduction in TXB2 generation
J Med Chem 56: 3191-206 (2013)
Article DOI: 10.1021/jm301370e
BindingDB Entry DOI: 10.7270/Q2JS9RSB
Prostaglandin G/H synthase (cyclooxygenase)
(Mus musculus)
BDBM50430948
(CHEMBL2337402)
Show SMILES Cc1c(CCOCCO[N+]([O-])=O)cc(-c2ccc(cc2)S(C)(=O)=O)n1-c1ccc(F)cc1
Show InChI InChI=1S/C22H23FN2O6S/c1-16-18(11-12-30-13-14-31-25(26)27)15-22(24(16)20-7-5-19(23)6-8-20)17-3-9-21(10-4-17)32(2,28)29/h3-10,15H,11-14H2,1-2H3
Reactome pathway
n/an/a>1.00E+4n/an/an/an/an/an/a
Universit£ degli Studi di Siena
Curated by ChEMBL
Assay Description
Inhibition of arachidonic acid-induced COX1 activity in mouse J774 cells assessed as decrease in PGE2 levels incubated for 15 mins prior to arachidon...
J Med Chem 56: 3191-206 (2013)
Article DOI: 10.1021/jm301370e
BindingDB Entry DOI: 10.7270/Q2JS9RSB
Cyclooxygenase-2 (COX-2)
(Mus musculus (Mouse))
BDBM50430948
(CHEMBL2337402)
Show SMILES Cc1c(CCOCCO[N+]([O-])=O)cc(-c2ccc(cc2)S(C)(=O)=O)n1-c1ccc(F)cc1
Show InChI InChI=1S/C22H23FN2O6S/c1-16-18(11-12-30-13-14-31-25(26)27)15-22(24(16)20-7-5-19(23)6-8-20)17-3-9-21(10-4-17)32(2,28)29/h3-10,15H,11-14H2,1-2H3
n/an/a 14n/an/an/an/an/an/a
Universit£ degli Studi di Siena
Curated by ChEMBL
Assay Description
Inhibition of Escherichia coli lipopolysaccharide-induced COX2 activity in mouse J774 cells assessed as decrease in PGE2 levels after 24 hrs by RIA
J Med Chem 56: 3191-206 (2013)
Article DOI: 10.1021/jm301370e
BindingDB Entry DOI: 10.7270/Q2JS9RSB
Cyclooxygenase
(Homo sapiens (Human))
BDBM50430948
(CHEMBL2337402)
Show SMILES Cc1c(CCOCCO[N+]([O-])=O)cc(-c2ccc(cc2)S(C)(=O)=O)n1-c1ccc(F)cc1
Show InChI InChI=1S/C22H23FN2O6S/c1-16-18(11-12-30-13-14-31-25(26)27)15-22(24(16)20-7-5-19(23)6-8-20)17-3-9-21(10-4-17)32(2,28)29/h3-10,15H,11-14H2,1-2H3
NCI pathway
Reactome pathway
n/an/a 640n/an/an/an/an/an/a
Universit£ degli Studi di Siena
Curated by ChEMBL
Assay Description
Inhibition of COX2 in human whole blood assessed as reduction in LPS-induced PGE2 generation pre-treated prior to LPS-challenge
J Med Chem 56: 3191-206 (2013)
Article DOI: 10.1021/jm301370e
BindingDB Entry DOI: 10.7270/Q2JS9RSB