BDBM50431249 CHEMBL2333059
SMILES: CCCCCCCNC(=O)n1ccc(=O)[nH]c1=O
InChI Key: InChIKey=AKNCRBJIXCHIIB-UHFFFAOYSA-N
Data: 1 IC50
Activity Spreadsheet -- Enzyme Inhibition Constant Data from BindingDB
Found 1 hit for monomerid = 50431249
Trg + Lig
Ki
nM
ΔG°
kcal/mole
IC50
nM
Kd
nM
EC50/IC50
nM
koff
s-1
kon
M-1s-1
pHTemp
°C
Acid ceramidase (AC)
(Rattus norvegicus (Rat))
BDBM50431249
(CHEMBL2333059)
Show SMILES CCCCCCCNC(=O)n1ccc(=O)[nH]c1=O
Show InChI InChI=1S/C12H19N3O3/c1-2-3-4-5-6-8-13-11(17)15-9-7-10(16)14-12(15)18/h7,9H,2-6,8H2,1H3,(H,13,17)(H,14,16,18)
n/an/a 325n/an/an/an/an/an/a
Fondazione Istituto Italiano di Tecnologia
Curated by ChEMBL
Assay Description
Inhibition of rat recombinant acid ceramidase expressed in human HEK293 cells using N-lauroylceramide as substrate incubated for 30 mins prior to sub...
J Med Chem 56: 3518-30 (2013)
Article DOI: 10.1021/jm301879g
BindingDB Entry DOI: 10.7270/Q27D2WH5