BDBM50431295 CHEMBL2348829
SMILES: SC1=NC(=O)C(S1)=Cc1cccc(Br)c1
InChI Key: InChIKey=OTYMLMRHOPDJMX-UHFFFAOYSA-N
Data: 1 KI  2 IC50
Activity Spreadsheet -- Enzyme Inhibition Constant Data from BindingDB
Found 3 hits for monomerid = 50431295
Trg + Lig
Ki
nM
ΔG°
kcal/mole
IC50
nM
Kd
nM
EC50/IC50
nM
koff
s-1
kon
M-1s-1
pHTemp
°C
CDGSH iron-sulfur domain-containing protein 1
(Homo sapiens (Human))
BDBM50431295
(CHEMBL2348829)
Show SMILES SC1=NC(=O)C(S1)=Cc1cccc(Br)c1 |w:7.8,t:1|
Show InChI InChI=1S/C10H6BrNOS2/c11-7-3-1-2-6(4-7)5-8-9(13)12-10(14)15-8/h1-5H,(H,12,13,14)
46n/an/an/an/an/an/an/an/a
West Virginia University
Curated by ChEMBL
Assay Description
Displacement of [3H]rosiglitazone from recombinant human C-terminal His-tagged MitoNEET cytosolic domain (32 to 108 residues) expressed in Escherichi...
Bioorg Med Chem Lett 26: 5350-5353 (2016)
Article DOI: 10.1016/j.bmcl.2016.09.009
BindingDB Entry DOI: 10.7270/Q2ZP483C
CDGSH iron-sulfur domain-containing protein 1
(Homo sapiens (Human))
BDBM50431295
(CHEMBL2348829)
Show SMILES SC1=NC(=O)C(S1)=Cc1cccc(Br)c1 |w:7.8,t:1|
Show InChI InChI=1S/C10H6BrNOS2/c11-7-3-1-2-6(4-7)5-8-9(13)12-10(14)15-8/h1-5H,(H,12,13,14)
n/an/a 1.07E+3n/an/an/an/an/an/a
West Virginia University
Curated by ChEMBL
Assay Description
Displacement of [3H]rosiglitazone from recombinant human C-terminal His-tagged MitoNEET cytosolic domain (32 to 108 residues) expressed in Escherichi...
Bioorg Med Chem Lett 26: 5350-5353 (2016)
Article DOI: 10.1016/j.bmcl.2016.09.009
BindingDB Entry DOI: 10.7270/Q2ZP483C
Apoptosis Signal-regulating Kinase 1 (ASK1)
(Homo sapiens (Human))
BDBM50431295
(CHEMBL2348829)
Show SMILES SC1=NC(=O)C(S1)=Cc1cccc(Br)c1 |w:7.8,t:1|
Show InChI InChI=1S/C10H6BrNOS2/c11-7-3-1-2-6(4-7)5-8-9(13)12-10(14)15-8/h1-5H,(H,12,13,14)
n/an/a>3.30E+4n/an/an/an/an/an/a
NAS of Ukraine
Curated by ChEMBL
Assay Description
Inhibition of human ASK1 using MBP as substrate incubated for 10 mins prior to ATP addition measured after 20 mins by liquid scintillation counting a...
Eur J Med Chem 61: 104-15 (2013)
Article DOI: 10.1016/j.ejmech.2012.09.022
BindingDB Entry DOI: 10.7270/Q2FX7BTH