BDBM50431642 CHEMBL475535
SMILES: CN(C)CCCNC(=O)c1cc(NC(=O)CN2CCCCC2)cc(Nc2ccnc3cc(Cl)ccc23)c1
InChI Key: InChIKey=LTNOFXLGDDNJGH-UHFFFAOYSA-N
Data: 1 Kd
Activity Spreadsheet -- Enzyme Inhibition Constant Data from BindingDB
Found 1 hit for monomerid = 50431642
Trg + Lig
Ki
nM
ΔG°
kcal/mole
IC50
nM
Kd
nM
EC50/IC50
nM
koff
s-1
kon
M-1s-1
pHTemp
°C
Heparanase
(Homo sapiens (Human))
BDBM50431642
(CHEMBL475535)
Show SMILES CN(C)CCCNC(=O)c1cc(NC(=O)CN2CCCCC2)cc(Nc2ccnc3cc(Cl)ccc23)c1
Show InChI InChI=1S/C28H35ClN6O2/c1-34(2)12-6-10-31-28(37)20-15-22(32-25-9-11-30-26-17-21(29)7-8-24(25)26)18-23(16-20)33-27(36)19-35-13-4-3-5-14-35/h7-9,11,15-18H,3-6,10,12-14,19H2,1-2H3,(H,30,32)(H,31,37)(H,33,36)
n/an/an/a>1.00E+6n/an/an/an/an/a
Structural Biochemistry Laboratory, Centro de Investigaci�n Pr�ncipe Felipe, 46012 Valencia, Spain. rgozalbes@cipf.es
Curated by ChEMBL
Assay Description
Binding affinity to recombinant heparanase catalytic stie (unknown origin) expressed in Escherichia coli BL21 (DE3) by surface plasmon resonance assa...
Bioorg Med Chem 21: 1944-51 (2013)
Article DOI: 10.1016/j.bmc.2013.01.033
BindingDB Entry DOI: 10.7270/Q2HQ419G