BDBM50431648 CHEMBL2349233
SMILES: CCOc1ccc(Nc2ccnc3cc(Cl)ccc23)cc1CN1CCCC1
InChI Key: InChIKey=SLYHXSVWVZQRIT-UHFFFAOYSA-N
Data: 1 Kd
Activity Spreadsheet -- Enzyme Inhibition Constant Data from BindingDB
Found 1 hit for monomerid = 50431648
Trg + Lig
Ki
nM
ΔG°
kcal/mole
IC50
nM
Kd
nM
EC50/IC50
nM
koff
s-1
kon
M-1s-1
pHTemp
°C
Heparanase
(Homo sapiens (Human))
BDBM50431648
(CHEMBL2349233)
Show SMILES CCOc1ccc(Nc2ccnc3cc(Cl)ccc23)cc1CN1CCCC1
Show InChI InChI=1S/C22H24ClN3O/c1-2-27-22-8-6-18(13-16(22)15-26-11-3-4-12-26)25-20-9-10-24-21-14-17(23)5-7-19(20)21/h5-10,13-14H,2-4,11-12,15H2,1H3,(H,24,25)
n/an/an/a 1.69E+5n/an/an/an/an/a
Structural Biochemistry Laboratory, Centro de Investigaci�n Pr�ncipe Felipe, 46012 Valencia, Spain. rgozalbes@cipf.es
Curated by ChEMBL
Assay Description
Binding affinity to recombinant heparanase catalytic stie (unknown origin) expressed in Escherichia coli BL21 (DE3) by surface plasmon resonance assa...
Bioorg Med Chem 21: 1944-51 (2013)
Article DOI: 10.1016/j.bmc.2013.01.033
BindingDB Entry DOI: 10.7270/Q2HQ419G