BDBM50431770 CHEMBL2346899
SMILES: Fc1ccc2[nH]c(=O)n([C@@H](CC3CCCCC3)C(=O)Nc3nccs3)c(=O)c2c1
InChI Key: InChIKey=FWNYYSSFAUKKJU-INIZCTEOSA-N
Data: 1 EC50
PDB links: 1 PDB ID matches this monomer.
Activity Spreadsheet -- Enzyme Inhibition Constant Data from BindingDB
Found 1 hit for monomerid = 50431770
Trg + Lig
Ki
nM
ΔG°
kcal/mole
IC50
nM
Kd
nM
EC50/IC50
nM
koff
s-1
kon
M-1s-1
pHTemp
°C
Hexokinase-4
(Homo sapiens (Human))
BDBM50431770
(CHEMBL2346899)
Show SMILES Fc1ccc2[nH]c(=O)n([C@@H](CC3CCCCC3)C(=O)Nc3nccs3)c(=O)c2c1 |r|
Show InChI InChI=1S/C20H21FN4O3S/c21-13-6-7-15-14(11-13)18(27)25(20(28)23-15)16(10-12-4-2-1-3-5-12)17(26)24-19-22-8-9-29-19/h6-9,11-12,16H,1-5,10H2,(H,23,28)(H,22,24,26)/t16-/m0/s1
NCI pathway
Reactome pathway
n/an/an/an/a 3.10E+3n/an/an/an/a
Takeda California
Curated by ChEMBL
Assay Description
Activation of glucokinase (unknown origin)
Bioorg Med Chem Lett 23: 2166-71 (2013)
Article DOI: 10.1016/j.bmcl.2013.01.093
BindingDB Entry DOI: 10.7270/Q2W09791
3D
3D Structure (crystal)