BDBM50431930 CHEMBL2348078
SMILES: OC(=O)Cc1sc(\C=C2/NC(=O)CS2)nc1-c1ccc(Br)cn1
InChI Key: InChIKey=BFSPDMQTMAIVRR-NYYWCZLTSA-N
Data: 1 IC50
Activity Spreadsheet -- Enzyme Inhibition Constant Data from BindingDB
Found 1 hit for monomerid = 50431930
Trg + Lig
Ki
nM
ΔG°
kcal/mole
IC50
nM
Kd
nM
EC50/IC50
nM
koff
s-1
kon
M-1s-1
pHTemp
°C
A disintegrin and metalloproteinase with thrombospondin motifs 5 (ADAMTS-5)
(Homo sapiens (Human))
BDBM50431930
(CHEMBL2348078)
Show SMILES OC(=O)Cc1sc(\C=C2/NC(=O)CS2)nc1-c1ccc(Br)cn1
Show InChI InChI=1S/C14H10BrN3O3S2/c15-7-1-2-8(16-5-7)14-9(3-13(20)21)23-12(18-14)4-11-17-10(19)6-22-11/h1-2,4-5H,3,6H2,(H,17,19)(H,20,21)/b11-4+
Reactome pathway
n/an/a 840n/an/an/an/an/an/a
Asahi Kasei Pharma Corporation
Curated by ChEMBL
Assay Description
Inhibition of human His-tagged ADAMTS-5 using QF-peptide as substrate by FRET method
Bioorg Med Chem Lett 23: 2106-10 (2013)
Article DOI: 10.1016/j.bmcl.2013.01.121
BindingDB Entry DOI: 10.7270/Q26974ZF