BDBM50431931 CHEMBL2348077
SMILES: OC(=O)Cc1sc(\C=C2/NC(=O)CS2)nc1-c1ccccn1
InChI Key: InChIKey=WUDWAGLEIQMKSZ-IZZDOVSWSA-N
Data: 1 IC50
Activity Spreadsheet -- Enzyme Inhibition Constant Data from BindingDB
Found 1 hit for monomerid = 50431931
Trg + Lig
Ki
nM
ΔG°
kcal/mole
IC50
nM
Kd
nM
EC50/IC50
nM
koff
s-1
kon
M-1s-1
pHTemp
°C
A disintegrin and metalloproteinase with thrombospondin motifs 5 (ADAMTS-5)
(Homo sapiens (Human))
BDBM50431931
(CHEMBL2348077)
Show SMILES OC(=O)Cc1sc(\C=C2/NC(=O)CS2)nc1-c1ccccn1
Show InChI InChI=1S/C14H11N3O3S2/c18-10-7-21-11(16-10)6-12-17-14(8-3-1-2-4-15-8)9(22-12)5-13(19)20/h1-4,6H,5,7H2,(H,16,18)(H,19,20)/b11-6+
Reactome pathway
n/an/a 400n/an/an/an/an/an/a
Asahi Kasei Pharma Corporation
Curated by ChEMBL
Assay Description
Inhibition of human His-tagged ADAMTS-5 using QF-peptide as substrate by FRET method
Bioorg Med Chem Lett 23: 2106-10 (2013)
Article DOI: 10.1016/j.bmcl.2013.01.121
BindingDB Entry DOI: 10.7270/Q26974ZF