BDBM50432113 CHEMBL2349575
SMILES: Cn1nnc(n1)-c1cccc(NC(=O)N(CCC(c2ccccc2)c2ccccc2)CCN2CCOCC2)c1
InChI Key: InChIKey=OESISWLNEDNSIO-UHFFFAOYSA-N
Data: 1 EC50
Activity Spreadsheet -- Enzyme Inhibition Constant Data from BindingDB
Found 1 hit for monomerid = 50432113
Trg + Lig
Ki
nM
ΔG°
kcal/mole
IC50
nM
Kd
nM
EC50/IC50
nM
koff
s-1
kon
M-1s-1
pHTemp
°C
Calcium-sensing receptor (CaSR)
(Homo sapiens (Human))
BDBM50432113
(CHEMBL2349575)
Show SMILES Cn1nnc(n1)-c1cccc(NC(=O)N(CCC(c2ccccc2)c2ccccc2)CCN2CCOCC2)c1
Show InChI InChI=1S/C30H35N7O2/c1-35-33-29(32-34-35)26-13-8-14-27(23-26)31-30(38)37(18-17-36-19-21-39-22-20-36)16-15-28(24-9-4-2-5-10-24)25-11-6-3-7-12-25/h2-14,23,28H,15-22H2,1H3,(H,31,38)
n/an/an/an/a 60n/an/an/an/a
Galapagos SASU
Curated by ChEMBL
Assay Description
Positive allosteric modulation of human CaSR transfected in CHO cells after 5 hrs by luciferase reporter gene assay
Bioorg Med Chem Lett 23: 2451-4 (2013)
Article DOI: 10.1016/j.bmcl.2013.01.078
BindingDB Entry DOI: 10.7270/Q2930VJZ