BDBM50432149 CHEMBL2346785
SMILES: COC(=O)c1cccc(NC(=O)N(CCC(c2ccccc2)c2ccccc2)CCC2CCCCC2)c1
InChI Key: InChIKey=BOMBPAKGWZYNAC-UHFFFAOYSA-N
Data: 1 EC50
Activity Spreadsheet -- Enzyme Inhibition Constant Data from BindingDB
Found 1 hit for monomerid = 50432149
Trg + Lig
Ki
nM
ΔG°
kcal/mole
IC50
nM
Kd
nM
EC50/IC50
nM
koff
s-1
kon
M-1s-1
pHTemp
°C
Calcium-sensing receptor (CaSR)
(Homo sapiens (Human))
BDBM50432149
(CHEMBL2346785)
Show SMILES COC(=O)c1cccc(NC(=O)N(CCC(c2ccccc2)c2ccccc2)CCC2CCCCC2)c1
Show InChI InChI=1S/C32H38N2O3/c1-37-31(35)28-18-11-19-29(24-28)33-32(36)34(22-20-25-12-5-2-6-13-25)23-21-30(26-14-7-3-8-15-26)27-16-9-4-10-17-27/h3-4,7-11,14-19,24-25,30H,2,5-6,12-13,20-23H2,1H3,(H,33,36)
n/an/an/an/a 1.00E+4n/an/an/an/a
Galapagos SASU
Curated by ChEMBL
Assay Description
Positive allosteric modulation of human CaSR transfected in CHO cells after 5 hrs by luciferase reporter gene assay
Bioorg Med Chem Lett 23: 2451-4 (2013)
Article DOI: 10.1016/j.bmcl.2013.01.078
BindingDB Entry DOI: 10.7270/Q2930VJZ