BDBM50432169 CHEMBL2346766
SMILES: COc1cccc(NC(=O)NCCC(c2ccccc2)c2ccccc2)c1
InChI Key: InChIKey=PVPVZHWHZNAJCA-UHFFFAOYSA-N
Data: 1 EC50
Activity Spreadsheet -- Enzyme Inhibition Constant Data from BindingDB
Found 1 hit for monomerid = 50432169
Trg + Lig
Ki
nM
ΔG°
kcal/mole
IC50
nM
Kd
nM
EC50/IC50
nM
koff
s-1
kon
M-1s-1
pHTemp
°C
Calcium-sensing receptor (CaSR)
(Homo sapiens (Human))
BDBM50432169
(CHEMBL2346766)
Show SMILES COc1cccc(NC(=O)NCCC(c2ccccc2)c2ccccc2)c1
Show InChI InChI=1S/C23H24N2O2/c1-27-21-14-8-13-20(17-21)25-23(26)24-16-15-22(18-9-4-2-5-10-18)19-11-6-3-7-12-19/h2-14,17,22H,15-16H2,1H3,(H2,24,25,26)
n/an/an/an/a 8.00E+3n/an/an/an/a
Galapagos SASU
Curated by ChEMBL
Assay Description
Positive allosteric modulation of human CaSR transfected in CHO cells after 5 hrs by luciferase reporter gene assay
Bioorg Med Chem Lett 23: 2451-4 (2013)
Article DOI: 10.1016/j.bmcl.2013.01.078
BindingDB Entry DOI: 10.7270/Q2930VJZ