BDBM50432210 CHEMBL2347155
SMILES: Nc1ccc2C(=O)N(CCNc3ccccc3)C(=O)c2c1
InChI Key: InChIKey=DVEKZOCKSSMCHV-UHFFFAOYSA-N
Data: 2 IC50
Activity Spreadsheet -- Enzyme Inhibition Constant Data from BindingDB
Found 2 hits for monomerid = 50432210
Trg + Lig
Ki
nM
ΔG°
kcal/mole
IC50
nM
Kd
nM
EC50/IC50
nM
koff
s-1
kon
M-1s-1
pHTemp
°C
Acidic alpha-glucosidase
(Rattus norvegicus)
BDBM50432210
(CHEMBL2347155)
Show SMILES Nc1ccc2C(=O)N(CCNc3ccccc3)C(=O)c2c1
Show InChI InChI=1S/C16H15N3O2/c17-11-6-7-13-14(10-11)16(21)19(15(13)20)9-8-18-12-4-2-1-3-5-12/h1-7,10,18H,8-9,17H2
n/an/a 1.44E+5n/an/an/an/an/an/a
Xi'an Jiaotong University
Curated by ChEMBL
Assay Description
Inhibition of rat intestinal maltase using maltose as substrate by colorimetric analysis
Bioorg Med Chem Lett 23: 2022-6 (2013)
Article DOI: 10.1016/j.bmcl.2013.02.011
BindingDB Entry DOI: 10.7270/Q2CV4K3J
Lactase-glycosylceramidase
(Rattus norvegicus)
BDBM50432210
(CHEMBL2347155)
Show SMILES Nc1ccc2C(=O)N(CCNc3ccccc3)C(=O)c2c1
Show InChI InChI=1S/C16H15N3O2/c17-11-6-7-13-14(10-11)16(21)19(15(13)20)9-8-18-12-4-2-1-3-5-12/h1-7,10,18H,8-9,17H2
n/an/a>2.00E+5n/an/an/an/an/an/a
Xi'an Jiaotong University
Curated by ChEMBL
Assay Description
Inhibition of rat intestinal lactase using lactose as substrate by colorimetric analysis
Bioorg Med Chem Lett 23: 2022-6 (2013)
Article DOI: 10.1016/j.bmcl.2013.02.011
BindingDB Entry DOI: 10.7270/Q2CV4K3J