BDBM50432222 CHEMBL2347143
SMILES: Cc1ccc(cc1)S(=O)(=O)Nc1ccc2C(=O)N(Cc3ccc(cc3)C#N)C(=O)c2c1
InChI Key: InChIKey=MAGJATWSBCVFNI-UHFFFAOYSA-N
Data: 2 IC50
Activity Spreadsheet -- Enzyme Inhibition Constant Data from BindingDB
Found 2 hits for monomerid = 50432222
Trg + Lig
Ki
nM
ΔG°
kcal/mole
IC50
nM
Kd
nM
EC50/IC50
nM
koff
s-1
kon
M-1s-1
pHTemp
°C
Acidic alpha-glucosidase
(Rattus norvegicus)
BDBM50432222
(CHEMBL2347143)
Show SMILES Cc1ccc(cc1)S(=O)(=O)Nc1ccc2C(=O)N(Cc3ccc(cc3)C#N)C(=O)c2c1
Show InChI InChI=1S/C23H17N3O4S/c1-15-2-9-19(10-3-15)31(29,30)25-18-8-11-20-21(12-18)23(28)26(22(20)27)14-17-6-4-16(13-24)5-7-17/h2-12,25H,14H2,1H3
n/an/a>2.00E+5n/an/an/an/an/an/a
Xi'an Jiaotong University
Curated by ChEMBL
Assay Description
Inhibition of rat intestinal maltase using maltose as substrate by colorimetric analysis
Bioorg Med Chem Lett 23: 2022-6 (2013)
Article DOI: 10.1016/j.bmcl.2013.02.011
BindingDB Entry DOI: 10.7270/Q2CV4K3J
Lactase-glycosylceramidase
(Rattus norvegicus)
BDBM50432222
(CHEMBL2347143)
Show SMILES Cc1ccc(cc1)S(=O)(=O)Nc1ccc2C(=O)N(Cc3ccc(cc3)C#N)C(=O)c2c1
Show InChI InChI=1S/C23H17N3O4S/c1-15-2-9-19(10-3-15)31(29,30)25-18-8-11-20-21(12-18)23(28)26(22(20)27)14-17-6-4-16(13-24)5-7-17/h2-12,25H,14H2,1H3
n/an/a 1.99E+5n/an/an/an/an/an/a
Xi'an Jiaotong University
Curated by ChEMBL
Assay Description
Inhibition of rat intestinal lactase using lactose as substrate by colorimetric analysis
Bioorg Med Chem Lett 23: 2022-6 (2013)
Article DOI: 10.1016/j.bmcl.2013.02.011
BindingDB Entry DOI: 10.7270/Q2CV4K3J