BDBM50432836 CHEMBL2376199
SMILES: CN(C)C(=O)n1nnc(n1)-c1ccc(cc1)-n1c(C)cc(C(C)=O)c1C
InChI Key: InChIKey=YKHLUXFIHCXYOJ-UHFFFAOYSA-N
Data: 2 IC50
Activity Spreadsheet -- Enzyme Inhibition Constant Data from BindingDB
Found 2 hits for monomerid = 50432836
Trg + Lig
Ki
nM
ΔG°
kcal/mole
IC50
nM
Kd
nM
EC50/IC50
nM
koff
s-1
kon
M-1s-1
pHTemp
°C
Fatty-acid amide hydrolase 1 (aa 30-579)
(Rattus norvegicus (rat))
BDBM50432836
(CHEMBL2376199)
Show SMILES CN(C)C(=O)n1nnc(n1)-c1ccc(cc1)-n1c(C)cc(C(C)=O)c1C
Show InChI InChI=1S/C18H20N6O2/c1-11-10-16(13(3)25)12(2)23(11)15-8-6-14(7-9-15)17-19-21-24(20-17)18(26)22(4)5/h6-10H,1-5H3
n/an/a 9n/an/an/an/an/an/a
University of M£nster
Curated by ChEMBL
Assay Description
Inhibition of FAAH in Sprague-Dawley rat brain microsomes assessed as N-(2-hydroxyethyl)-4-pyren-1-ylbutanamide conversion to 4-pyren-1-ylbutanoic ac...
Eur J Med Chem 63: 64-75 (2013)
Article DOI: 10.1016/j.ejmech.2013.01.050
BindingDB Entry DOI: 10.7270/Q2377B2N
Monoglyceride lipase
(Homo sapiens (Human))
BDBM50432836
(CHEMBL2376199)
Show SMILES CN(C)C(=O)n1nnc(n1)-c1ccc(cc1)-n1c(C)cc(C(C)=O)c1C
Show InChI InChI=1S/C18H20N6O2/c1-11-10-16(13(3)25)12(2)23(11)15-8-6-14(7-9-15)17-19-21-24(20-17)18(26)22(4)5/h6-10H,1-5H3
Reactome pathway
n/an/a 36n/an/an/an/an/an/a
University of M£nster
Curated by ChEMBL
Assay Description
Inhibition of human recombinant MAGL-mediated 1,3-dihydroxypropan-1-yl 4-pyren-1-ylbutanoate conversion to 4-pyren-1-ylbutanoic acid preincubated for...
Eur J Med Chem 63: 64-75 (2013)
Article DOI: 10.1016/j.ejmech.2013.01.050
BindingDB Entry DOI: 10.7270/Q2377B2N