BDBM50432856 CHEMBL2376208
SMILES: CN(C)C(=O)n1nnnc1Cc1ccc(Oc2ccccc2)cc1
InChI Key: InChIKey=DVTFOUNGCJJHLN-UHFFFAOYSA-N
Data: 2 IC50
Activity Spreadsheet -- Enzyme Inhibition Constant Data from BindingDB
Found 2 hits for monomerid = 50432856
Trg + Lig
Ki
nM
ΔG°
kcal/mole
IC50
nM
Kd
nM
EC50/IC50
nM
koff
s-1
kon
M-1s-1
pHTemp
°C
Monoglyceride lipase
(Homo sapiens (Human))
BDBM50432856
(CHEMBL2376208)
Show SMILES CN(C)C(=O)n1nnnc1Cc1ccc(Oc2ccccc2)cc1
Show InChI InChI=1S/C17H17N5O2/c1-21(2)17(23)22-16(18-19-20-22)12-13-8-10-15(11-9-13)24-14-6-4-3-5-7-14/h3-11H,12H2,1-2H3
Reactome pathway
n/an/a 310n/an/an/an/an/an/a
University of M£nster
Curated by ChEMBL
Assay Description
Inhibition of human recombinant MAGL-mediated 1,3-dihydroxypropan-1-yl 4-pyren-1-ylbutanoate conversion to 4-pyren-1-ylbutanoic acid preincubated for...
Eur J Med Chem 63: 64-75 (2013)
Article DOI: 10.1016/j.ejmech.2013.01.050
BindingDB Entry DOI: 10.7270/Q2377B2N
Fatty-acid amide hydrolase 1 (aa 30-579)
(Rattus norvegicus (rat))
BDBM50432856
(CHEMBL2376208)
Show SMILES CN(C)C(=O)n1nnnc1Cc1ccc(Oc2ccccc2)cc1
Show InChI InChI=1S/C17H17N5O2/c1-21(2)17(23)22-16(18-19-20-22)12-13-8-10-15(11-9-13)24-14-6-4-3-5-7-14/h3-11H,12H2,1-2H3
n/an/a 6n/an/an/an/an/an/a
University of M£nster
Curated by ChEMBL
Assay Description
Inhibition of FAAH in Sprague-Dawley rat brain microsomes assessed as N-(2-hydroxyethyl)-4-pyren-1-ylbutanamide conversion to 4-pyren-1-ylbutanoic ac...
Eur J Med Chem 63: 64-75 (2013)
Article DOI: 10.1016/j.ejmech.2013.01.050
BindingDB Entry DOI: 10.7270/Q2377B2N