BDBM50432894 CHEMBL2376648::US9126947, 1
SMILES: C[C@@H](Oc1cc(nnc1N)C(=O)Nc1ccc(cc1)C(=O)N1CCN(C)CC1)c1c(Cl)ccc(F)c1Cl
InChI Key: InChIKey=ONPGOSVDVDPBCY-CQSZACIVSA-N
Data: 2 IC50
Activity Spreadsheet -- Enzyme Inhibition Constant Data from BindingDB
Found 2 hits for monomerid = 50432894
Trg + Lig
Ki
nM
ΔG°
kcal/mole
IC50
nM
Kd
nM
EC50/IC50
nM
koff
s-1
kon
M-1s-1
pHTemp
°C
Hepatocyte growth factor receptor
(Homo sapiens (Human))
BDBM50432894
(CHEMBL2376648 | US9126947, 1)
Show SMILES C[C@@H](Oc1cc(nnc1N)C(=O)Nc1ccc(cc1)C(=O)N1CCN(C)CC1)c1c(Cl)ccc(F)c1Cl |r|
Show InChI InChI=1S/C25H25Cl2FN6O3/c1-14(21-17(26)7-8-18(28)22(21)27)37-20-13-19(31-32-23(20)29)24(35)30-16-5-3-15(4-6-16)25(36)34-11-9-33(2)10-12-34/h3-8,13-14H,9-12H2,1-2H3,(H2,29,32)(H,30,35)/t14-/m1/s1
n/an/a 0.690n/an/an/an/an/an/a
Chinese Academy of Sciences
Curated by ChEMBL
Assay Description
Inhibition of c-MET (unknown origin)
Bioorg Med Chem Lett 23: 2408-13 (2013)
Article DOI: 10.1016/j.bmcl.2013.02.037
BindingDB Entry DOI: 10.7270/Q2TQ62XH
ALK tyrosine kinase receptor
(Homo sapiens (Human))
BDBM50432894
(CHEMBL2376648 | US9126947, 1)
Show SMILES C[C@@H](Oc1cc(nnc1N)C(=O)Nc1ccc(cc1)C(=O)N1CCN(C)CC1)c1c(Cl)ccc(F)c1Cl |r|
Show InChI InChI=1S/C25H25Cl2FN6O3/c1-14(21-17(26)7-8-18(28)22(21)27)37-20-13-19(31-32-23(20)29)24(35)30-16-5-3-15(4-6-16)25(36)34-11-9-33(2)10-12-34/h3-8,13-14H,9-12H2,1-2H3,(H2,29,32)(H,30,35)/t14-/m1/s1
US Patent
n/an/a<1n/an/an/an/an/a32
Xcovery Holding Company LLC
US Patent
Assay Description
Assays were performed as described in Fabian et al. (2005) Nature Biotechnology, vol. 23, p. 329 and in Karaman et al. (2008) Nature Biotechnology, v...
US Patent US9126947 (2015)
BindingDB Entry DOI: 10.7270/Q2T152DH