BDBM50432924 CHEMBL2376868
SMILES: CN(C)C(=O)n1nnnc1Cc1ccc(cc1)-c1cccc(C)c1
InChI Key: InChIKey=DCTITAHEQGKURN-UHFFFAOYSA-N
Data: 4 IC50  1 EC50
Activity Spreadsheet -- Enzyme Inhibition Constant Data from BindingDB
Found 5 hits for monomerid = 50432924
Trg + Lig
Ki
nM
ΔG°
kcal/mole
IC50
nM
Kd
nM
EC50/IC50
nM
koff
s-1
kon
M-1s-1
pHTemp
°C
Fatty-acid amide hydrolase 1 (aa 30-579)
(Rattus norvegicus (rat))
BDBM50432924
(CHEMBL2376868)
Show SMILES CN(C)C(=O)n1nnnc1Cc1ccc(cc1)-c1cccc(C)c1
Show InChI InChI=1S/C18H19N5O/c1-13-5-4-6-16(11-13)15-9-7-14(8-10-15)12-17-19-20-21-23(17)18(24)22(2)3/h4-11H,12H2,1-3H3
n/an/a 9.70n/an/an/an/an/an/a
Sapienza Universit£ di Roma
Curated by ChEMBL
Assay Description
Inhibition of FAAH in rat brain membranes assessed as [14C]AEA hydrolysis to [14C]Ethanolamine after 30 mins by scintillation counting analysis
Eur J Med Chem 63: 118-32 (2013)
Article DOI: 10.1016/j.ejmech.2013.02.005
BindingDB Entry DOI: 10.7270/Q2K64KFB
Transient receptor potential cation channel subfamily A member 1
(Rattus norvegicus)
BDBM50432924
(CHEMBL2376868)
Show SMILES CN(C)C(=O)n1nnnc1Cc1ccc(cc1)-c1cccc(C)c1
Show InChI InChI=1S/C18H19N5O/c1-13-5-4-6-16(11-13)15-9-7-14(8-10-15)12-17-19-20-21-23(17)18(24)22(2)3/h4-11H,12H2,1-3H3
n/an/an/an/a 3.28E+4n/an/an/an/a
Sapienza Universit£ di Roma
Curated by ChEMBL
Assay Description
Agonist activity at rat TRPA1 receptor expressed in HEK293 cells assessed as increase in intracellular Ca2+ concentration by spectrofluorimetric anal...
Eur J Med Chem 63: 118-32 (2013)
Article DOI: 10.1016/j.ejmech.2013.02.005
BindingDB Entry DOI: 10.7270/Q2K64KFB
Monoglyceride lipase
(Homo sapiens (Human))
BDBM50432924
(CHEMBL2376868)
Show SMILES CN(C)C(=O)n1nnnc1Cc1ccc(cc1)-c1cccc(C)c1
Show InChI InChI=1S/C18H19N5O/c1-13-5-4-6-16(11-13)15-9-7-14(8-10-15)12-17-19-20-21-23(17)18(24)22(2)3/h4-11H,12H2,1-3H3
Reactome pathway
n/an/a>1.00E+3n/an/an/an/an/an/a
Sapienza Universit£ di Roma
Curated by ChEMBL
Assay Description
Inhibition of MAGL (unknown origin) expressed in African green monkey COS7 cell cytosolic fraction assessed as [3H]2-AG hydrolysis to [3H]arachidonic...
Eur J Med Chem 63: 118-32 (2013)
Article DOI: 10.1016/j.ejmech.2013.02.005
BindingDB Entry DOI: 10.7270/Q2K64KFB
Transient receptor potential cation channel subfamily V member 1
(Homo sapiens (Human))
BDBM50432924
(CHEMBL2376868)
Show SMILES CN(C)C(=O)n1nnnc1Cc1ccc(cc1)-c1cccc(C)c1
Show InChI InChI=1S/C18H19N5O/c1-13-5-4-6-16(11-13)15-9-7-14(8-10-15)12-17-19-20-21-23(17)18(24)22(2)3/h4-11H,12H2,1-3H3
Reactome pathway
n/an/a>1.00E+5n/an/an/an/an/an/a
Sapienza Universit£ di Roma
Curated by ChEMBL
Assay Description
Antagonist activity at human TRPV1 receptor expressed in HEK293 cells assessed as inhibition of capsaicin-induced intracellular Ca2+ elevation incuba...
Eur J Med Chem 63: 118-32 (2013)
Article DOI: 10.1016/j.ejmech.2013.02.005
BindingDB Entry DOI: 10.7270/Q2K64KFB
Transient receptor potential cation channel subfamily A member 1
(Rattus norvegicus)
BDBM50432924
(CHEMBL2376868)
Show SMILES CN(C)C(=O)n1nnnc1Cc1ccc(cc1)-c1cccc(C)c1
Show InChI InChI=1S/C18H19N5O/c1-13-5-4-6-16(11-13)15-9-7-14(8-10-15)12-17-19-20-21-23(17)18(24)22(2)3/h4-11H,12H2,1-3H3
n/an/a 4.10E+4n/an/an/an/an/an/a
Sapienza Universit£ di Roma
Curated by ChEMBL
Assay Description
Antagonist activity at rat TRPA1 receptor expressed in HEK293 cells assessed as inhibition of allyl isothiocyanate-induced intracellular Ca2+ elevati...
Eur J Med Chem 63: 118-32 (2013)
Article DOI: 10.1016/j.ejmech.2013.02.005
BindingDB Entry DOI: 10.7270/Q2K64KFB