null
SMILES: O=C(Nc1nc2ccccc2[nH]1)N(CCC(c1ccccc1)c1ccccc1)CCN1CCOCC1
InChI Key: InChIKey=MCVGAZGWMPVBGX-UHFFFAOYSA-N
Activity Spreadsheet -- Enzyme Inhibition Constant Data from BindingDB
Found 1 hit for monomerid = 50432949
Trg + Lig
Ki
nM
ΔG°
kcal/mole
IC50
nM
Kd
nM
EC50/IC50
nM
koff
s-1
kon
M-1s-1
pHTemp
°C
Extracellular calcium-sensing receptor
(Homo sapiens (Human))
BDBM50432949
(CHEMBL2377736)
Show SMILES O=C(Nc1nc2ccccc2[nH]1)N(CCC(c1ccccc1)c1ccccc1)CCN1CCOCC1
Show InChI InChI=1S/C29H33N5O2/c35-29(32-28-30-26-13-7-8-14-27(26)31-28)34(18-17-33-19-21-36-22-20-33)16-15-25(23-9-3-1-4-10-23)24-11-5-2-6-12-24/h1-14,25H,15-22H2,(H2,30,31,32,35)
n/an/an/an/a 60n/an/an/an/a
Galapagos SASU
Curated by ChEMBL
Assay Description
Positive allosteric modulation of human CaSR expressed in CHO cells assessed as increase in intracellular calcium level after 5 hrs by luciferase rep...
Bioorg Med Chem Lett 23: 2455-9 (2013)
Article DOI: 10.1016/j.bmcl.2013.01.077
BindingDB Entry DOI: 10.7270/Q228090Q