null
SMILES: FC(F)(F)Oc1ccc2nc(NC(=O)N(CCC(c3ccccc3)c3ccccc3)CCN3CCOCC3)sc2c1
InChI Key: InChIKey=XAWRUXJWRYIPJC-UHFFFAOYSA-N
Activity Spreadsheet -- Enzyme Inhibition Constant Data from BindingDB
Found 1 hit for monomerid = 50432971
Trg + Lig
Ki
nM
ΔG°
kcal/mole
IC50
nM
Kd
nM
EC50/IC50
nM
koff
s-1
kon
M-1s-1
pHTemp
°C
Extracellular calcium-sensing receptor
(Homo sapiens (Human))
BDBM50432971
(CHEMBL2377745)
Show SMILES FC(F)(F)Oc1ccc2nc(NC(=O)N(CCC(c3ccccc3)c3ccccc3)CCN3CCOCC3)sc2c1
Show InChI InChI=1S/C30H31F3N4O3S/c31-30(32,33)40-24-11-12-26-27(21-24)41-28(34-26)35-29(38)37(16-15-36-17-19-39-20-18-36)14-13-25(22-7-3-1-4-8-22)23-9-5-2-6-10-23/h1-12,21,25H,13-20H2,(H,34,35,38)
n/an/an/an/a 90n/an/an/an/a
Galapagos SASU
Curated by ChEMBL
Assay Description
Positive allosteric modulation of human CaSR expressed in CHO cells assessed as increase in intracellular calcium level after 5 hrs by luciferase rep...
Bioorg Med Chem Lett 23: 2455-9 (2013)
Article DOI: 10.1016/j.bmcl.2013.01.077
BindingDB Entry DOI: 10.7270/Q228090Q